program: Gaussian 09
title: 000193276
version: EM64L-G09RevD.01
frameworkgroup: C1[X(C2H4N3O)]
method: RPBEPBE
basis: SDD
operation: Freq
keyword: #p
keyword: freq=noraman
keyword: PBEPBE/SDD
title: #p freq=noraman PBEPBE/SDD
converged: YES YES YES YES
title: Mulliken charges:
elementType: O N N N C C H H H H
charge: -0.365584 -0.584526 0.112760 0.140977 0.416043 -0.252736 0.323153 0.389128 0.392545 0.428240
chargesum: 1.00000
title: Mulliken charges with hydrogens summed into heavy atoms:
elementType: O N N N C C
charge: 0.062656 0.197147 0.112760 0.140977 0.416043 0.070417
polarizability: 8.56529125e+01 5.86915787e+00 4.04260865e+01 -4.34557510e-03 1.24693059e-03 1.84315282e+01
1716.lowfreq: -0.0014 -0.0012 -0.0010 6.2121 7.3901 11.2733 102.6900 155.6034 284.6912
frequency: 102.6888 155.6031 284.6900 393.8871 449.5644 473.3638 526.4943 592.9648 629.1262 668.7976 724.9957 917.2916 1020.9020 1091.0977 1163.1669 1337.9508 1496.6225 1616.3237 1668.5203 2108.2339 3200.9033 3504.9815 3573.5796 3631.0649
redmass: 3.2459 7.6907 1.2364 5.4186 3.7302 1.1292 4.9228 1.7822 5.0478 1.4110 2.3049 5.3433 1.6696 1.2827 2.0965 1.7928 4.3246 3.4590 1.3428 13.4903 1.0923 1.0489 1.0683 1.1044
irintensity: 16.1720 0.7644 16.9237 1.1528 1.2022 134.2529 3.7863 15.4793 18.1135 183.9621 272.3401 51.8747 8.9920 148.8104 7.3002 1.9218 93.8067 389.8338 385.9112 213.3545 31.6966 253.4897 175.3420 97.9877
temp: 298.150 k
press: 1.00000 atm
elementType: 8 7 7 7 6 6 1 1 1 1
symmnumber: 1
zpe: 187411.8 jmol-1
zpe.correction: 0.071381 hartree
zpe.thermalcorrener: 0.077734 hartree
zpe.thermalcorrenthalpy: 0.078678 hartree
zpe.thermalcorrgfe: 0.041525 hartree
zpe.sumelectzpe: -317.329491 hartree
zpe.sumelectthermal: -317.323138 hartree
zpe.sumelectthermalent: -317.322194 hartree
zpe.sumelectthermalfe: -317.359347 hartree
dipole: -5.3931 -1.2949 0.0006
dipole: 5.5464
quadrupole: -11.8386 -21.3578 -34.5540
quadrupole: -3.4767 -0.0031 0.0006
quadrupole: 10.7449 1.2256 -11.9705 -3.4767 -0.0031 0.0006
hfenergy: -317.4008719 hartree
pointgroup: C01 [X(C2H4N3O1)]
dipole: 2.1250308 0.4958198 0.0002324 debye
dipolederiv: -0.2546191 -0.0066143 0.0000082 0.3189635 -1.1600341 0.0000464 -0.0000059 0.0000323 -0.3824386 -1.466316 -0.2690679 -0.0000716 -0.3132376 -0.3843625 -0.0000761 -0.0001031 -0.0000645 -0.5917714 1.5379081 0.1911138 0.0002475 0.6668676 0.084872 0.000123 -0.0000789 -0.0000155 0.229829 -0.637832 -0.0288935 -0.0002198 -0.3036692 0.0696061 -0.0000935 0.0001465 0.0000227 0.0667675 2.1808594 0.0619285 0.0001978 -0.5305221 1.3400174 -0.0000741 0.0002343 -0.0000348 0.3979137 -1.341052 0.017954 -0.0000592 0.1345504 -0.0910611 0.000041 -0.0001015 0.0000447 -0.278709 0.0765398 -0.009805 -0.0000424 0.00187 0.1805228 -0.0000005 -0.0000495 -0.000012 0.2742421 0.4078326 0.0100298 -0.0000053 -0.0884442 0.1844987 0.000006 -0.000006 0.0000251 0.4094835 0.2783127 0.0494737 -0.0000312 0.1767218 0.285264 0.0000299 -0.0000283 0.0000113 0.4182236 0.2183663 -0.0161191 -0.0000239 -0.0631001 0.4906767 -0.0000022 -0.0000076 -0.0000092 0.4564596 unknown
polarizability: 85.7263084|5.5787242|40.3526906|0.0043375|-0.0012748|18.4315282 unknown
InChI: InChI=1S/C2H4N3O/c3-2(6)1-5-4/h1,6H,3H2
charge 1 multiplicity 1
10 atoms
O  0.763503 -1.348168 0.000148
N  2.270933 0.484099 0.000306
N  -1.354237 0.2748 -0.000223
N  -2.425696 -0.18342 0.000026
C  1.013894 -0.014161 0.000139
C  -0.129688 0.827767 -0.000063
H  -0.080645 1.9171 -0.000028
H  3.102359 -0.111421 0.000497
H  2.433874 1.493359 0.000264
H  1.538003 -1.967155 0.000232
