program: Gaussian 09
title: 000193264
version: EM64L-G09RevD.01
frameworkgroup: C1[X(C4H8ClNO)]
method: RPBEPBE
basis: SDD
operation: Freq
keyword: #p
keyword: freq=noraman
keyword: PBEPBE/SDD
title: #p freq=noraman PBEPBE/SDD
converged: NO NO NO NO
title: Mulliken charges:
elementType: Cl O N C C C C H H H H H H H H
charge: -0.048219 -0.273851 -0.329890 -0.209369 -0.678335 0.227741 -0.657554 0.230151 0.230150 0.211792 0.227671 0.227699 0.292069 0.292076 0.257868
chargesum: 0.00000
title: Mulliken charges with hydrogens summed into heavy atoms:
elementType: Cl O N C C C C
charge: -0.048219 -0.273851 -0.072022 0.250933 -0.011173 0.227741 -0.073408
polarizability: 8.66721446e+01 -5.96537304e+00 6.07619564e+01 2.27795484e-04 2.88015318e-04 4.01888914e+01
1716.lowfreq: -15.5814 -6.4864 -0.0036 -0.0031 -0.0028 8.3186 37.9687 83.5269 125.7471
frequency: 35.1157 83.1092 125.6862 135.4994 242.6671 248.3346 326.4352 388.7470 513.3319 623.2509 712.6481 798.7217 820.8409 847.8594 914.3235 933.3483 1009.6199 1033.1940 1111.9646 1136.5229 1140.9859 1223.8152 1244.5187 1298.3036 1362.0754 1400.1995 1428.5122 1463.1853 1474.4870 1487.4493 1644.7358 2994.8622 3012.7425 3061.9562 3069.5238 3091.8947 3106.4512 3140.9651 3381.6539
redmass: 3.5497 2.7096 2.0541 4.5520 1.2293 6.2970 4.8265 3.7623 3.1588 4.0859 6.2811 1.0916 3.5309 1.1748 4.9212 1.5729 1.8106 2.5046 2.2423 1.4519 1.1119 1.4332 1.1375 1.7648 1.5068 1.2809 1.0945 1.0404 1.0580 1.0712 7.1143 1.0357 1.0586 1.0563 1.1062 1.0984 1.1026 1.1091 1.0756
irintensity: 3.6077 1.3861 16.5232 1.8260 2.2320 3.8641 11.7769 3.4358 3.9466 5.1175 28.6969 0.0651 16.8179 52.2816 17.1392 19.9159 137.9751 178.9868 3.6102 4.4833 0.1596 122.7473 0.0090 78.2138 9.3632 23.9600 22.8570 11.9611 6.4969 14.0197 121.4683 21.1469 15.8842 7.3261 6.4887 29.5856 48.3249 3.0551 8.0453
temp: 298.150 k
press: 1.00000 atm
elementType: 17 8 7 6 6 6 6 1 1 1 1 1 1 1 1
symmnumber: 1
zpe: 311445.0 jmol-1
zpe.correction: 0.118623 hartree
zpe.thermalcorrener: 0.127142 hartree
zpe.thermalcorrenthalpy: 0.128086 hartree
zpe.thermalcorrgfe: 0.084077 hartree
zpe.sumelectzpe: -746.670627 hartree
zpe.sumelectthermal: -746.662109 hartree
zpe.sumelectthermalent: -746.661165 hartree
zpe.sumelectthermalfe: -746.705174 hartree
dipole: 1.5059 -1.2497 0.0032
dipole: 1.9569
quadrupole: -47.6235 -50.9500 -48.8800
quadrupole: 0.1900 -0.0013 -0.0005
quadrupole: 1.5276 -1.7988 0.2712 0.1900 -0.0013 -0.0005
hfenergy: -746.7892506 hartree
pointgroup: C01 [X(C4H8Cl1N1O1)]
dipole: 0.5525904 -0.4784134 0.2419041 debye
dipolederiv: -0.5029594 0.0528271 0.0093737 0.102958 -0.1848496 0.0079097 -0.0230599 0.0140784 -0.1591507 -1.5959479 0.3430603 -0.0618089 0.1646486 -0.5287115 0.1179158 0.0531593 0.095675 -0.3828136 -0.4168584 -0.0748237 0.0470468 0.2930667 -0.8181475 0.2159566 -0.1907073 0.2615883 -0.5730922 0.9342328 -0.0845419 -0.0191421 0.1196926 0.2644933 0.0354411 -0.1505924 0.0608039 0.3217909 -0.1289946 0.0815688 -0.0280161 0.0692588 0.021732 0.0216586 -0.0199557 0.020116 0.0583972 1.210961 -0.2976224 0.0522744 -0.3824011 0.7739183 -0.3929882 0.1066346 -0.4034635 0.3399194 0.4870796 -0.1501515 0.0676548 -0.337622 0.1131944 0.1292215 0.1893265 0.105953 0.1556091 -0.0375638 0.0235609 -0.0439732 -0.0433888 0.0705891 0.0093633 0.0369869 0.0113028 -0.1270749 -0.0350141 0.029887 0.0035377 -0.0695138 -0.0989854 -0.0557431 0.0297606 -0.0783407 0.0400763 -0.1265225 -0.0491654 0.0619734 -0.0705783 0.0614939 0.0438054 0.0757817 0.0411446 0.0794964 0.1084676 0.0045075 0.0083541 0.0350823 0.0842428 0.0033239 -0.0490215 0.0238285 -0.1491403 0.1035399 -0.0468461 -0.024322 0.0205383 -0.1213069 -0.0733628 -0.0303064 -0.0816155 0.0615371 -0.0155602 0.0234002 -0.0454229 0.0388782 0.0915628 0.0096238 -0.0089602 0.0317398 -0.0420831 -0.0116737 0.0394313 0.0117342 0.016373 -0.0427154 -0.0291009 -0.0198885 -0.0520628 0.0885689 0.0268136 0.1049079 -0.0392637 0.0430074 0.3134897 -0.0430246 0.0008424 -0.0507479 0.2879594 unknown
polarizability: 85.1858979|-9.0451691|56.2806474|0.2372711|-9.2759229|46.1564471 unknown
InChI: InChI=1S/C4H8ClNO/c1-2-7-4(6)3-5/h6H,2-3H2,1H3
charge 0 multiplicity 1
15 atoms
Cl -3.370707 0.417725 0.321989
O  0.597177 -0.313015 0.299015
N  -0.569597 1.466373 -0.705053
C  1.864319 0.270205 -0.234859
C  2.995069 -0.64822 0.217556
C  -0.572046 0.378399 -0.001822
C  -1.719981 -0.397645 0.644174
H  1.777771 0.335821 -1.334516
H  1.962395 1.298746 0.156924
H  3.959864 -0.258084 -0.155154
H  3.044525 -0.70285 1.318673
H  2.857615 -1.669524 -0.17737
H  -1.592307 -0.440863 1.735838
H  -1.779975 -1.415721 0.232203
H  -1.520625 1.858353 -0.839497
