program: Gaussian 09
title: 000017584
version: EM64L-G09RevD.01
frameworkgroup: C1[X(C6HCl3N2O4)]
method: RPBEPBE
basis: SDD
operation: Freq
keyword: #p
keyword: freq=noraman
keyword: PBEPBE/SDD
title: #p freq=noraman PBEPBE/SDD
converged: YES YES NO NO
title: Mulliken charges:
elementType: Cl Cl Cl O O O O N N C C C C C C H
charge: 0.119801 0.104558 0.052982 -0.131798 -0.132793 -0.178408 -0.155235 -0.016789 0.002715 0.749386 0.612885 -0.559297 -0.330459 -0.384141 -0.071731 0.318326
chargesum: 0.00000
title: Mulliken charges with hydrogens summed into heavy atoms:
elementType: Cl Cl Cl O O O O N N C C C C C C
charge: 0.119801 0.104558 0.052982 -0.131798 -0.132793 -0.178408 -0.155235 -0.016789 0.002715 0.749386 0.612885 -0.559297 -0.330459 -0.065815 -0.071731
polarizability: 1.73224551e+02 -5.19899930e+00 1.55414667e+02 -1.16659233e+00 4.52481425e+00 6.49398647e+01
1716.lowfreq: -0.0013 0.0003 0.0022 4.4152 6.4432 8.8603 39.3634 41.6681 57.9075
frequency: 39.3571 41.6301 57.9043 68.3798 118.3307 143.5618 166.2678 189.7764 196.4173 210.1504 288.7134 303.6749 311.0842 327.1654 378.0619 388.1954 502.7795 524.8383 553.5769 599.5459 625.7312 681.3815 702.5482 713.3808 738.5542 749.5369 834.8768 874.0678 912.5891 1056.5792 1157.6429 1172.2903 1197.0731 1227.5899 1327.9895 1367.3540 1394.2159 1405.8141 1406.0912 1549.5606 1572.6395 3183.8138
redmass: 16.3605 16.1093 24.4507 21.9473 13.1403 17.3903 18.9677 28.7384 9.6225 23.9418 18.8464 14.2654 16.1052 25.4593 9.9249 7.7420 11.0243 11.4929 11.8781 6.5217 8.4496 11.7224 11.9941 11.2689 6.8906 13.9543 12.2256 11.8772 1.4927 10.7458 2.0181 4.1722 13.7353 14.4304 10.9521 8.3002 6.6710 6.7365 9.6574 11.1371 8.8973 1.0927
irintensity: 0.3656 0.0864 0.9545 0.4762 2.2234 2.5155 0.9186 0.0306 0.6155 0.1245 0.1405 0.7619 0.5470 0.3920 3.3805 4.2311 5.2067 9.0568 19.4343 2.0187 29.5246 31.6979 11.7271 6.1756 2.0232 3.5236 2.3944 59.7947 20.4323 42.6412 4.8965 40.1421 293.9407 79.9070 3.2466 4.9053 25.6116 247.1204 138.5261 17.8211 22.6053 16.2679
temp: 298.150 k
press: 1.00000 atm
elementType: 17 17 17 8 8 8 8 7 7 6 6 6 6 6 6 1
symmnumber: 1
zpe: 186980.7 jmol-1
zpe.correction: 0.071217 hartree
zpe.thermalcorrener: 0.085112 hartree
zpe.thermalcorrenthalpy: 0.086056 hartree
zpe.thermalcorrgfe: 0.027898 hartree
zpe.sumelectzpe: -2018.529405 hartree
zpe.sumelectthermal: -2018.515510 hartree
zpe.sumelectthermalent: -2018.514566 hartree
zpe.sumelectthermalfe: -2018.572724 hartree
dipole: -1.9727 2.0699 -0.0170
dipole: 2.8594
quadrupole: -115.5915 -112.1128 -107.2142
quadrupole: -8.2652 0.8271 -1.6962
quadrupole: -3.9520 -0.4733 4.4253 -8.2652 0.8271 -1.6962
hfenergy: -2018.600622 hartree
pointgroup: C01 [X(C6H1Cl3N2O4)]
dipole: 0.258563 1.0898538 0.1047149 debye
dipolederiv: -0.0019364 -0.0668714 -0.0254764 -0.1054693 -0.5287642 -0.0840278 -0.0325301 -0.1003652 0.0447753 -0.6094597 -0.2216229 -0.0554235 -0.1488762 -0.0474568 -0.0178795 -0.0433398 -0.020309 0.0424844 -0.0496822 -0.1199858 -0.0132417 -0.128666 -0.6797187 -0.0687704 -0.0121284 -0.0689921 0.0011677 -0.3759506 0.2195946 -0.099873 0.2073214 -0.3599347 0.1524207 0.0171929 0.0445839 -0.6354508 -0.3880099 0.1993755 0.1562134 0.2138889 -0.3406783 -0.0810435 0.0441635 0.0226095 -0.6507796 -0.7496282 0.1619696 -0.1246308 0.1341017 -0.5044173 0.1769769 -0.0867462 0.1484578 -0.2883628 -0.6037791 -0.1773067 0.0260529 -0.1720837 -0.5349889 0.182512 -0.0259257 0.1598262 -0.256713 0.6629876 -0.5251068 -0.0689037 -0.5206081 0.5934982 -0.0816197 -0.0708025 -0.0867203 1.2457466 1.7500591 0.0545438 0.1414206 0.173481 0.851551 -0.4273066 0.1575208 -0.334867 0.3598726 -0.1634948 -0.1978434 -0.0387468 -0.1894076 -0.2031283 -0.042716 -0.0332188 -0.0373835 0.0364307 -0.5852073 -0.100677 -0.0460152 -0.1804921 -0.0939406 0.0338674 -0.0502171 -0.0022509 0.1006539 0.2272486 0.2837074 0.0460224 0.0485638 0.8394098 0.1436556 0.0954879 0.1668685 -0.0569437 1.0026447 0.3021106 0.089048 0.2415841 0.001292 0.0182935 0.0721885 0.0297732 -0.0512018 0.0660421 -0.0935408 0.0096326 0.2466808 -0.2559075 -0.0026818 -0.0453871 -0.0447114 -0.057656 -0.3084556 0.2656977 0.0064241 0.1987059 1.1512383 0.1132974 -0.0034089 0.1088527 -0.0076836 0.1266218 0.0159555 -0.0025029 -0.0187245 0.1119462 -0.0149784 0.017151 0.0146276 0.17366 unknown
polarizability: 163.8160248|10.0114848|164.4942758|6.7826799|3.7973056|65.2687827 unknown
InChI: InChI=1S/C6HCl3N2O4/c7-2-1-3(10(12)13)5(9)6(4(2)8)11(14)15/h1H
charge 0 multiplicity 1
16 atoms
Cl -0.707137 -2.584407 -0.329318
Cl 3.04273 1.405476 0.284891
Cl 0.67753 3.661368 0.349581
O  2.432866 -1.936312 1.062647
O  2.512605 -1.724722 -1.217498
O  -3.605659 0.783222 -0.601684
O  -3.256354 -1.278332 0.314883
N  2.051616 -1.437398 -0.055599
N  -2.845875 -0.144511 -0.124252
C  0.962882 -0.413315 0.002457
C  -1.386523 0.159798 -0.053516
C  -0.38064 -0.836506 -0.094401
C  1.318528 0.944007 0.148718
C  -1.050927 1.524884 0.067197
C  0.291456 1.915617 0.176602
H  -1.856298 2.26393 0.068892
