program: Gaussian 09
title: 000193245
version: EM64L-G09RevD.01
frameworkgroup: C1[X(C11H12BrNO3)]
method: RPBEPBE
basis: SDD
operation: Freq
keyword: #p
keyword: freq=noraman
keyword: PBEPBE/SDD
title: #p freq=noraman PBEPBE/SDD
converged: YES YES NO NO
title: Mulliken charges:
elementType: Br O O O N C C C C C C C C C C C H H H H H H H H H H H H
charge: -0.040865 -0.424795 -0.213963 -0.255535 -0.373878 -0.146797 -0.606947 0.523224 0.168854 -0.369274 -0.405794 0.314496 -0.224694 -0.234056 -0.236674 -0.749093 0.308067 0.223480 0.248465 0.338582 0.230556 0.230237 0.226853 0.226894 0.229139 0.308667 0.312929 0.391924
chargesum: 0.00000
title: Mulliken charges with hydrogens summed into heavy atoms:
elementType: Br O O O N C C C C C C C C C C C
charge: -0.040865 -0.032871 -0.213963 -0.255535 -0.035296 0.161271 -0.135002 0.523224 0.168854 -0.138719 -0.175557 0.314496 0.002159 -0.007162 -0.007535 -0.127498
polarizability: 1.50770758e+02 -7.23278247e+00 1.61031160e+02 3.42604596e+01 1.31779564e+00 1.21006559e+02
1716.lowfreq: -7.9573 -0.0006 -0.0005 -0.0002 6.3456 9.4984 16.1020 22.6124 31.7334
frequency: 15.8210 22.3619 31.6619 34.1493 56.9562 73.9673 79.4950 95.7167 145.0052 194.0790 236.9217 283.8433 318.9907 340.9212 387.7201 403.1007 455.8547 489.7306 537.0606 552.3938 589.6249 601.0096 614.3124 617.6271 637.2750 652.2165 692.6877 702.6464 758.4282 804.1136 849.4939 867.3168 871.0238 879.0148 925.0500 939.9846 974.6468 990.5729 995.1443 998.9810 1026.8183 1076.3293 1088.0516 1112.8486 1143.9288 1173.1753 1188.1944 1194.1207 1217.0076 1227.5178 1252.7103 1265.7646 1300.3864 1311.0912 1328.4686 1335.5558 1385.1722 1411.1228 1441.9916 1470.0263 1484.7255 1508.0344 1595.0775 1600.6393 1615.3853 1668.6412 2997.2965 3042.8548 3063.4093 3069.2482 3117.2599 3118.5592 3134.0003 3147.0278 3152.2884 3164.6967 3509.8403 3523.4982
redmass: 9.1178 3.9166 8.0849 6.0400 5.5633 4.7117 6.4474 3.9593 7.0809 7.2543 4.9533 5.9433 10.1756 2.6322 3.0644 2.7907 5.2844 3.5809 3.6971 3.4686 1.8674 3.8981 2.3801 5.6115 3.7312 1.3517 3.8418 1.7718 1.8459 4.9843 1.2624 2.5945 1.7879 2.3740 1.8549 4.1211 1.3956 6.0249 1.3339 2.7952 2.1825 2.1811 1.7741 2.5015 1.1358 1.0561 1.1225 1.3579 2.5160 1.2217 1.7002 1.4896 1.8138 1.3547 1.4885 1.3441 7.4522 1.0959 2.1594 1.1329 2.3216 1.9608 6.0551 9.2055 6.1997 9.3425 1.0595 1.0866 1.1009 1.0566 1.0875 1.0874 1.0907 1.0958 1.1087 1.1015 1.0779 1.0643
irintensity: 0.0893 0.3827 2.0340 1.2260 3.0886 8.9602 2.3432 3.6463 0.3495 7.7586 1.0723 3.9157 2.0207 1.1351 5.0472 0.0200 28.4111 1.9040 12.7132 7.6416 110.1868 5.9711 42.9743 2.5967 105.5825 157.2523 24.1342 45.6530 47.7643 6.0282 0.7117 10.7432 19.1079 17.5537 17.4033 15.4453 0.0686 0.3596 0.1330 0.7626 6.3294 147.2793 57.4097 26.1993 0.2518 0.0736 1.6238 5.1617 1.6619 40.7419 7.7354 18.3434 55.2095 2.5969 12.4936 2.7223 0.0766 35.5324 8.9332 36.6875 12.3241 257.5002 1.2187 147.8972 7.7403 257.0346 21.5434 4.2272 10.5057 1.7604 6.9869 6.7170 10.0891 36.3631 0.0529 21.4719 61.6517 37.1420
temp: 298.150 k
press: 1.00000 atm
elementType: 35 8 8 8 7 6 6 6 6 6 6 6 6 6 6 6 1 1 1 1 1 1 1 1 1 1 1 1
symmnumber: 1
zpe: 557338.3 jmol-1
zpe.correction: 0.212279 hartree
zpe.thermalcorrener: 0.228345 hartree
zpe.thermalcorrenthalpy: 0.229289 hartree
zpe.thermalcorrgfe: 0.163449 hartree
zpe.sumelectzpe: -719.095541 hartree
zpe.sumelectthermal: -719.079475 hartree
zpe.sumelectthermalent: -719.078531 hartree
zpe.sumelectthermalfe: -719.144371 hartree
dipole: -0.5848 -0.2028 -2.2615
dipole: 2.3447
quadrupole: -101.3437 -100.4663 -105.8618
quadrupole: -9.5239 1.0468 -5.2357
quadrupole: 1.2136 2.0910 -3.3045 -9.5239 1.0468 -5.2357
hfenergy: -719.3078201 hartree
pointgroup: C01 [X(C11H12Br1N1O3)]
dipole: 0.0162148 0.0874867 -0.9181755 debye
polarizability: 158.8113367|-14.7513938|128.3124077|21.2769887|27.4892454|145.6847327 unknown
InChI: InChI=1S/C11H12BrNO3/c12-7-10(14)13-9(11(15)16)6-8-4-2-1-3-5-8/h1-5,9,13,15H,6-7H2
charge 0 multiplicity 1
28 atoms
Br -1.279413 -3.469147 -2.00642
O  -3.48166 0.52791 -1.215902
O  -3.33281 2.1868 0.408431
O  -0.441522 -1.534615 1.654695
N  -1.293897 -0.738883 -0.371806
C  -1.435384 0.643249 0.085916
C  -0.390923 1.613593 -0.582513
C  1.043343 1.213487 -0.280511
C  -2.832653 1.202561 -0.171762
C  1.626576 1.522832 0.974939
C  1.819146 0.512191 -1.237246
C  -0.797241 -1.718672 0.448677
C  2.954014 1.143033 1.267274
C  3.149317 0.129287 -0.948626
C  3.720649 0.444128 0.305275
C  -0.644254 -3.138846 -0.097032
H  -1.264399 0.64497 1.177393
H  -0.570607 1.621093 -1.674164
H  -0.605071 2.629231 -0.200527
H  -1.623094 -0.984876 -1.309971
H  1.038778 2.062671 1.728069
H  1.383459 0.269252 -2.214518
H  3.389714 1.38901 2.241943
H  3.73752 -0.409194 -1.700322
H  4.751565 0.149249 0.530774
H  -1.219944 -3.836604 0.528464
H  0.420297 -3.416899 -0.092083
H  -4.371408 0.940793 -1.383348
