program: Gaussian 09
title: 000193242
version: EM64L-G09RevD.01
frameworkgroup: C1[X(C5H11NO5)]
method: RPBEPBE
basis: SDD
operation: Freq
keyword: #p
keyword: freq=noraman
keyword: PBEPBE/SDD
title: #p freq=noraman PBEPBE/SDD
converged: YES YES NO NO
title: Mulliken charges:
elementType: O O O O O N C C C C C H H H H H H H H H H H
charge: -0.453727 -0.545952 -0.448842 -0.489645 -0.412794 -0.112624 -0.185837 -0.022146 -0.128801 -0.358073 -0.174837 0.244532 0.239258 0.259532 0.235269 0.207785 0.275351 0.362886 0.392987 0.383904 0.364794 0.366981
chargesum: 0.00000
title: Mulliken charges with hydrogens summed into heavy atoms:
elementType: O O O O O N C C C C C
charge: -0.090841 -0.152965 -0.064938 -0.124851 -0.045813 -0.112624 0.058695 0.217113 0.130731 0.084980 0.100513
polarizability: 8.91821525e+01 -6.95113672e+00 8.59577645e+01 -4.77166574e+00 -9.60219778e-02 6.73180005e+01
1716.lowfreq: -13.2133 -0.0009 -0.0007 0.0004 5.8763 18.2602 51.0258 59.3223 99.6301
frequency: 50.9163 59.2983 99.6209 112.0357 162.7268 177.4689 196.3350 254.3625 264.6347 304.3649 317.3202 338.0059 385.2215 401.8910 440.5774 491.0273 502.8217 521.2244 551.1183 668.3521 688.8761 695.4582 848.6927 873.1423 882.7988 929.3555 966.7340 992.5748 1021.1504 1027.4781 1036.2729 1057.8631 1135.0504 1176.5557 1179.0687 1206.3731 1227.6060 1252.3150 1270.0479 1292.8875 1319.4873 1332.8224 1355.0095 1384.8712 1399.1698 1421.0695 1459.4038 1468.1698 1593.9581 2971.8244 2996.1859 2999.6398 3050.9893 3060.0271 3095.3971 3268.6651 3277.6157 3510.0271 3560.9332 3606.1128
redmass: 4.7552 6.2414 2.8694 3.6991 5.7295 4.9044 8.3842 3.0590 1.4065 5.4613 4.7099 7.8457 1.1329 3.2925 5.3540 4.1516 1.6671 1.9332 4.1619 1.1727 1.1135 2.4081 2.8352 3.0534 8.3423 1.5585 6.0206 4.7612 4.5673 2.4121 2.5992 1.9599 2.5114 1.2144 1.1914 1.1956 1.1311 1.4754 1.1238 1.2904 1.2771 1.1991 1.4807 1.3661 1.4564 1.3309 1.1525 1.0816 6.7279 1.0613 1.0824 1.0835 1.0887 1.1018 1.0920 1.0669 1.0670 1.0651 1.0676 1.0670
irintensity: 2.2003 2.0106 1.2632 6.8771 6.0701 7.2505 3.7194 47.4168 97.5090 6.4624 1.0188 0.4628 135.6224 3.8337 32.8168 30.9730 136.6104 80.1813 13.1929 144.1279 165.0226 6.7840 30.4416 28.7248 137.5362 10.8142 39.2787 131.6574 28.2995 23.8124 48.9335 4.0234 25.4217 13.4625 13.4641 30.2994 5.2533 15.3348 44.7076 36.8407 11.9948 14.7063 60.8165 21.7234 38.9729 37.9257 118.1361 19.8455 0.9758 32.0207 25.7336 24.2499 25.1469 59.7265 4.3062 134.3054 329.1984 41.4529 46.7519 10.9837
temp: 298.150 k
press: 1.00000 atm
elementType: 8 8 8 8 8 7 6 6 6 6 6 1 1 1 1 1 1 1 1 1 1 1
symmnumber: 1
zpe: 449742.1 jmol-1
zpe.correction: 0.171298 hartree
zpe.thermalcorrener: 0.183891 hartree
zpe.thermalcorrenthalpy: 0.184835 hartree
zpe.thermalcorrgfe: 0.132525 hartree
zpe.sumelectzpe: -627.008270 hartree
zpe.sumelectthermal: -626.995678 hartree
zpe.sumelectthermalent: -626.994733 hartree
zpe.sumelectthermalfe: -627.047043 hartree
dipole: -2.5995 -3.1899 -0.3642
dipole: 4.1310
quadrupole: -50.3379 -66.8496 -71.2175
quadrupole: -2.4618 0.1219 1.1704
quadrupole: 12.4638 -4.0480 -8.4158 -2.4618 0.1219 1.1704
hfenergy: -627.1795682 hartree
pointgroup: C01 [X(C5H11N1O5)]
dipole: 1.0040955 -1.2600798 0.2132887 debye
dipolederiv: -0.689501 0.0055875 -0.1064943 0.0206145 -0.6203449 -0.1336863 -0.1018896 -0.1075025 -0.5544881 -0.6936003 -0.0811287 -0.0079725 -0.0115497 -0.6393763 -0.1725762 -0.0149744 -0.2113941 -0.6582365 -0.6785925 -0.1003715 0.0339141 -0.1444335 -0.6870547 -0.1053268 -0.0216389 -0.1474763 -0.5599603 -0.5766317 -0.0012236 -0.2736863 0.0402247 -0.5853345 0.128654 -0.3393054 0.1288582 -0.5397549 -0.8444865 -0.569045 0.1883311 -0.2971441 -0.4209808 0.2249806 0.39431 0.5743829 -0.5077665 0.1738609 0.5172347 -0.1993803 0.2745271 0.1510189 -0.1611667 -0.3459134 -0.4355691 -0.0144284 0.4231061 0.0609202 0.0809328 0.0268678 0.3329338 0.0704679 0.1318228 -0.0165696 0.3488612 0.2536159 0.1412628 -0.0111267 0.1668602 0.397065 0.1759866 0.032682 0.1551679 0.3154919 0.3931798 0.2671992 0.0358243 0.2477124 0.4697579 0.0186523 0.058234 0.1186543 0.3086372 0.3765821 0.0335744 0.245295 -0.0338502 0.3056689 -0.1631516 0.1838027 -0.1399928 0.4020805 0.0082803 -0.0728105 -0.1196781 -0.099659 -0.0627411 0.0659362 -0.1784124 -0.0280038 0.0580375 -0.0559277 -0.086113 0.0698076 -0.0577307 0.0015777 0.0440167 0.0547955 0.069071 -0.0125967 0.010298 -0.0910895 0.0424598 -0.0785645 -0.080837 0.0202305 0.0698989 0.0377461 -0.03123 -0.042306 -0.0427586 -0.0507351 -0.0022559 0.0056712 0.0607186 -0.0751849 0.0435348 -0.059303 0.0792125 -0.0154497 -0.04535 -0.0168028 -0.0839926 -0.0954353 -0.0415723 -0.0520986 -0.0191431 -0.0303241 -0.0470103 0.0350085 -0.081168 -0.0355775 0.1369817 0.0095487 0.0950487 -0.0808899 0.0859526 0.0102971 0.0987039 0.0128848 0.0577418 -0.0392806 0.1347489 -0.0441997 0.0831914 0.4772738 -0.0373628 -0.056739 -0.0531501 0.2691107 0.0415254 -0.0800885 0.0405153 0.3379656 0.3092456 0.0211701 -0.1146202 0.0364455 0.3058133 0.0608045 -0.1073413 0.0530328 0.3235222 0.5493905 -0.0517927 0.026555 -0.1366754 0.3727301 -0.0155113 0.0482797 0.0067254 0.3225868 0.1239148 0.101069 0.0640826 0.1016886 0.3560914 -0.0422894 0.1134932 -0.0540528 0.2468214 0.3474571 0.037841 0.0648677 0.0851584 0.1910586 -0.1205308 0.0747046 -0.085878 0.2906019 unknown
polarizability: 89.6154772|6.7835541|85.8149081|-4.2528812|-0.1869977|67.0275322 unknown
InChI: InChI=1S/C5H11NO5/c7-2-4(9)5(10)3(8)1-6-11/h1,3-5,7-11H,2H2
charge 0 multiplicity 1
22 atoms
O  -0.04565 -0.829564 -1.842721
O  1.505654 0.984019 1.033091
O  -0.499092 2.398254 0.097971
O  3.282359 -1.015273 0.957718
O  -3.07096 -1.44923 0.935278
N  -2.04042 -0.896089 0.051288
C  0.356999 0.324438 -1.032052
C  1.212264 -0.171692 0.158562
C  -0.878336 1.175981 -0.600174
C  2.539539 -0.782249 -0.300609
C  -1.895957 0.390916 0.230504
H  0.978176 0.958713 -1.688886
H  0.647281 -0.927184 0.741627
H  -1.38244 1.505989 -1.529951
H  2.354828 -1.721795 -0.852993
H  3.085028 -0.064778 -0.947778
H  -2.496865 0.962933 0.954228
H  -0.791481 -1.280255 -1.338074
H  2.256348 0.716118 1.626875
H  0.269933 2.158303 0.702351
H  4.191724 -1.349242 0.765435
H  -3.088734 -2.410013 0.687106
