program: Gaussian 09
title: 000193184
version: EM64L-G09RevD.01
frameworkgroup: C1[X(C6H13FO5)]
method: RPBEPBE
basis: SDD
operation: Freq
keyword: #p
keyword: freq=noraman
keyword: PBEPBE/SDD
title: #p freq=noraman PBEPBE/SDD
converged: YES YES NO NO
title: Mulliken charges:
elementType: F O O O O O C C C C C C H H H H H H H H H H H H H
charge: -0.262848 -0.509256 -0.428737 -0.461698 -0.498195 -0.463802 -0.156349 -0.165004 -0.056045 -0.003371 -0.356631 -0.370553 0.225276 0.250383 0.229379 0.246560 0.240062 0.240361 0.192897 0.235505 0.384813 0.356084 0.372546 0.373652 0.384971
chargesum: 0.00000
title: Mulliken charges with hydrogens summed into heavy atoms:
elementType: F O O O O O C C C C C C
charge: -0.262848 -0.124443 -0.072652 -0.089153 -0.124543 -0.078831 0.068928 0.085378 0.173334 0.243188 0.123792 0.057849
polarizability: 9.02682668e+01 -7.56641755e-01 8.43477737e+01 -1.85907762e-01 3.16203710e+00 7.12789350e+01
1716.lowfreq: -12.8268 -7.2169 -0.0003 0.0001 0.0007 8.4686 66.9096 73.4934 110.6858
frequency: 66.8623 73.4811 110.6530 134.5487 158.8798 170.6895 189.3253 197.2366 252.5052 263.4346 270.2265 284.6336 308.5343 398.0201 408.0925 414.3611 430.1238 504.2541 514.3757 526.2998 574.0114 591.8624 694.7238 723.3529 790.7966 855.2918 888.1990 943.8352 951.7355 986.6386 1002.0110 1005.2324 1029.1700 1043.8158 1067.3237 1069.9465 1100.1794 1135.8500 1181.5351 1217.8001 1232.8192 1253.8492 1261.7120 1285.4977 1314.2870 1315.4644 1326.3549 1342.5763 1356.3199 1366.5472 1379.2850 1397.8733 1403.2828 1418.5309 1468.6594 1475.3129 2960.1898 2960.3278 3003.6450 3024.8847 3073.5262 3078.7922 3092.0490 3106.1940 3301.2743 3464.1733 3479.6019 3545.4445 3606.3387
redmass: 4.7603 6.4197 5.8466 5.7921 3.6438 3.7486 5.9497 4.1581 6.1133 5.5172 1.1415 4.4378 4.2070 2.8224 4.0302 1.4975 2.9857 2.3510 1.8606 2.9057 2.1624 1.4921 1.2692 2.7145 3.3514 2.2727 3.0809 3.0856 3.3232 4.0351 4.5628 4.2904 3.1631 1.9454 2.8182 2.3296 2.3047 1.1845 1.1005 1.3393 1.2234 1.2464 1.1821 1.2210 1.3341 1.2120 1.1523 1.3324 1.3985 1.2599 1.3209 1.2735 1.6249 1.1422 1.0818 1.0789 1.0831 1.0702 1.0852 1.0609 1.0865 1.0853 1.0948 1.1064 1.0702 1.0643 1.0647 1.0657 1.0668
irintensity: 8.2388 3.6295 10.0204 3.7196 15.9995 10.0379 5.4946 4.1936 3.1525 11.3521 125.7653 44.0968 22.2664 14.8770 2.2904 30.5041 7.1282 129.3095 50.4682 24.5525 71.2030 176.1358 187.1419 52.2091 29.6055 6.3227 12.5492 67.6745 161.9846 24.8557 29.0695 34.9105 31.1439 19.6265 34.4206 54.0320 8.1146 5.7078 23.9316 47.7364 10.5341 15.0625 61.4924 7.3835 1.6518 11.6801 8.6709 24.0849 7.1010 2.8186 22.8236 40.1791 25.7939 36.6364 7.3909 8.4094 50.4081 24.6325 38.6609 35.5766 6.4311 8.2394 51.5578 22.0297 332.0194 23.3782 52.9889 39.8749 24.9855
temp: 298.150 k
press: 1.00000 atm
elementType: 9 8 8 8 8 8 6 6 6 6 6 6 1 1 1 1 1 1 1 1 1 1 1 1 1
symmnumber: 1
zpe: 525308.1 jmol-1
zpe.correction: 0.200079 hartree
zpe.thermalcorrener: 0.213664 hartree
zpe.thermalcorrenthalpy: 0.214609 hartree
zpe.thermalcorrgfe: 0.160814 hartree
zpe.sumelectzpe: -711.357704 hartree
zpe.sumelectthermal: -711.344119 hartree
zpe.sumelectthermalent: -711.343175 hartree
zpe.sumelectthermalfe: -711.396969 hartree
dipole: 1.1706 0.1643 -0.5387
dipole: 1.2991
quadrupole: -79.3865 -73.1546 -72.6683
quadrupole: 7.6283 4.8067 5.5498
quadrupole: -4.3167 1.9152 2.4015 7.6283 4.8067 5.5498
hfenergy: -711.5577832 hartree
pointgroup: C01[X(C6H13F1O5)]
dipole: 0.4323169 0.0123246 0.2723391 debye
dipolederiv: -0.4593813 0.0675809 0.0332927 0.1362677 -0.741694 -0.0877877 0.0727361 -0.1444387 -0.3384674 -0.4319606 0.0457693 -0.1721222 0.0115363 -0.8278748 -0.0491866 -0.164827 -0.066676 -0.5229419 -0.6503363 -0.0477107 -0.0247369 -0.0384137 -0.3984332 0.2132276 0.0363956 0.2665834 -0.6205016 -0.675257 -0.2018824 -0.0245578 -0.2269881 -0.570614 -0.1170017 0.0164198 -0.1276056 -0.5163333 -0.6628478 -0.1136897 -0.1942119 -0.0927573 -0.8382467 0.0280201 -0.2822497 0.0837016 -0.3526985 -0.5857679 0.2039098 0.1006642 0.1486089 -0.7060471 0.0663354 0.1106702 0.0994688 -0.5487601 0.1311481 -0.1242797 0.0088759 -0.0403814 0.5100717 0.0047775 0.066559 0.0401469 0.2003375 0.2302384 0.1085864 -0.0670489 0.0690054 0.201709 -0.1705891 -0.1209618 -0.242014 0.3312 0.3484511 0.1356961 0.0452312 0.0898055 0.301316 0.1111633 -0.0361676 0.1616336 0.3672448 0.3675786 -0.1313941 0.0347233 -0.0958316 0.576036 0.1435287 -0.0096139 0.1762563 0.2813609 0.3448219 0.1578696 0.1004158 0.1410646 0.5639161 0.0782978 0.169118 0.1135199 0.3041933 0.3114534 -0.1642828 0.0129291 -0.1060164 0.4892713 0.0133036 -0.0427086 0.0406554 0.2634609 0.0445439 -0.0026175 0.0352581 -0.0029556 -0.0210663 0.043885 0.067195 0.0748997 -0.1301441 0.087731 0.028764 0.0291619 0.0174927 -0.0369309 -0.0209984 0.0424426 -0.0618002 0.0725361 0.0082523 -0.0064537 0.0063822 -0.0143659 -0.0002089 -0.0238429 0.0174043 -0.0568302 -0.1761892 -0.0260065 -0.0039145 -0.0769848 0.0200916 0.0341812 0.0034858 -0.0764924 -0.014352 -0.0387931 0.0798964 -0.024409 0.0676375 -0.0246248 0.0438674 -0.0402617 0.0149185 -0.0162047 -0.0927573 -0.1480582 0.0543955 -0.016722 0.0454599 -0.0040895 -0.0169844 0.0194986 -0.0230226 0.0906354 0.0507125 -0.0178508 -0.1107976 0.0078244 -0.0599597 -0.0954399 -0.0611684 -0.0780625 -0.1294681 -0.1486081 -0.0022986 0.0512923 -0.0371305 0.0467756 0.0219718 0.0131425 0.0130891 0.0839785 0.2138574 0.0684835 0.0853344 0.0339021 0.3562533 0.0404681 0.0770097 0.05198 0.3249712 0.3529866 -0.0034482 0.0593971 -0.015597 0.1762793 -0.0529874 0.0489539 -0.1139602 0.3453535 0.4278508 0.0707807 -0.0165404 0.0725645 0.2136599 0.0365102 -0.0406297 0.0430927 0.3094366 0.2034337 -0.0372632 0.079905 -0.0591795 0.387846 -0.0458513 0.124045 -0.1113478 0.1739273 0.5852676 -0.0603408 -0.0467783 -0.039382 0.3039825 -0.0840438 -0.0616898 -0.1087127 0.3184186 unknown
polarizability: 89.8726957|1.0936427|85.2011377|2.2485224|0.4070065|70.8211421 unknown
InChI: InChI=1S/C6H13FO5/c7-3(1-8)5(11)6(12)4(10)2-9/h3-6,8-12H,1-2H2
charge 0 multiplicity 1
25 atoms
F  -2.30092 1.30858 0.2702
O  0.475253 2.019142 0.171001
O  -0.366873 0.800455 -2.067381
O  2.792178 0.909061 0.78715
O  1.092294 -2.379155 0.336855
O  -1.747056 -2.393719 0.328619
C  0.403137 0.539979 0.266338
C  -0.546427 0.01671 -0.847452
C  1.849674 0.020257 0.10788
C  -2.003462 -0.01097 -0.375406
C  2.037923 -1.341591 0.811072
C  -2.29706 -1.094636 0.69447
H  0.027021 0.264956 1.271308
H  -0.274934 -1.013656 -1.125384
H  2.095263 -0.045333 -0.974405
H  -2.677331 -0.066733 -1.246881
H  1.833372 -1.221805 1.887014
H  3.082209 -1.681548 0.688364
H  -1.92314 -0.735792 1.677468
H  -3.385539 -1.240264 0.778558
H  -0.376173 2.387925 0.524451
H  -0.154931 1.730449 -1.776675
H  2.41967 1.828832 0.696129
H  1.454698 -2.845192 -0.454757
H  -0.752846 -2.416154 0.470166
