program: Gaussian 09
title: 000193173
version: EM64L-G09RevD.01
frameworkgroup: C1[X(C5H5NO4S2)]
method: RPBEPBE
basis: SDD
operation: Freq
keyword: #p
keyword: freq=noraman
keyword: PBEPBE/SDD
title: #p freq=noraman PBEPBE/SDD
converged: NO NO NO NO
title: Mulliken charges:
elementType: S S O O O O N C C C C C H H H H H
charge: 1.050098 0.380340 -0.574574 -0.493246 -0.491084 -0.155132 -0.005418 -0.641059 0.323678 -0.310271 -0.483981 -0.182452 0.323046 0.322703 0.283942 0.273489 0.379921
chargesum: 0.00000
title: Mulliken charges with hydrogens summed into heavy atoms:
elementType: S S O O O O N C C C C C
charge: 1.050098 0.380340 -0.194654 -0.493246 -0.491084 -0.155132 -0.005418 0.004691 0.323678 -0.310271 -0.200040 0.091037
polarizability: 1.65072248e+02 6.53614688e+00 1.15836490e+02 -1.85765315e-01 1.41824089e-02 6.79648387e+01
1716.lowfreq: -11.7494 -4.5984 -0.0003 0.0013 0.0022 5.0678 13.1837 43.4001 76.1329
frequency: 10.6728 42.6692 76.1286 90.6746 146.2933 157.4539 176.6748 187.9558 229.2030 236.3090 300.6344 310.8798 371.6696 436.9344 457.6794 523.6197 562.7977 576.7535 630.6778 630.7719 691.5436 744.1318 767.7192 846.0554 851.0352 870.6730 888.9205 919.3519 986.1672 1032.8163 1057.3938 1117.3702 1126.4387 1215.5614 1284.4700 1299.4001 1373.0372 1408.4842 1472.9841 1597.1532 3066.3798 3151.3953 3209.0395 3250.6393 3508.3424
redmass: 6.1424 10.5175 7.8486 6.2863 11.0106 4.4028 2.0746 8.1010 1.9124 10.7933 5.0671 10.8571 9.6000 4.4813 10.5022 16.4104 2.9939 9.0965 7.7537 5.7348 7.5672 7.8788 1.2090 10.4944 5.8540 2.3479 1.3589 4.7111 6.3932 1.1818 1.5429 2.0146 1.1855 1.7093 3.1198 1.7497 1.0981 5.1004 7.8168 11.0328 1.0577 1.1066 1.0927 1.1010 1.0665
irintensity: 0.4320 0.5076 1.7585 7.8796 0.6088 14.9077 20.2762 2.9824 49.1799 12.7033 61.3701 21.9882 73.5800 0.1393 8.1253 166.5463 6.5554 21.3879 1.6653 2.0604 1.6403 14.0937 75.5772 35.3373 4.1286 0.4943 2.2905 84.8219 102.0476 72.4131 11.1353 33.8205 10.8004 27.8259 41.4800 10.4804 34.3128 106.5096 77.7606 94.0406 6.7094 4.8524 4.4477 1.0634 47.2341
temp: 298.150 k
press: 1.00000 atm
elementType: 16 16 8 8 8 8 7 6 6 6 6 6 1 1 1 1 1
symmnumber: 1
zpe: 262538.2 jmol-1
zpe.correction: 0.099996 hartree
zpe.thermalcorrener: 0.112967 hartree
zpe.thermalcorrenthalpy: 0.113911 hartree
zpe.thermalcorrgfe: 0.057848 hartree
zpe.sumelectzpe: -1344.195512 hartree
zpe.sumelectthermal: -1344.182540 hartree
zpe.sumelectthermalent: -1344.181596 hartree
zpe.sumelectthermalfe: -1344.237659 hartree
dipole: 5.8150 3.9640 0.0623
dipole: 7.0378
quadrupole: -63.2143 -90.3562 -90.2870
quadrupole: -5.7966 -0.2415 0.1348
quadrupole: 18.0715 -9.0703 -9.0011 -5.7966 -0.2415 0.1348
hfenergy: -1344.2955073 hartree
pointgroup: C01 [X(C5H5N1O4S2)]
dipole: -2.4084144 1.3649629 -0.0569021 debye
dipolederiv: 1.8072624 0.1478962 -0.0304346 0.234969 1.4461079 -0.0215775 -0.0390079 -0.0157777 1.3685908 0.0262988 -0.1085693 0.016457 -0.2359661 -0.2486213 0.0499037 0.0277633 0.0451562 0.2089777 -0.5963632 -0.3541892 0.0192523 -0.4061924 -0.8942799 0.0472436 0.0254669 0.0481469 -0.596344 -0.6371586 0.0309977 0.0292784 0.0253088 -0.4738925 -0.0281927 0.0564309 -0.1327421 -0.6060184 -0.6431813 0.0344152 -0.0311267 0.0196674 -0.4481634 0.0037222 -0.0582588 0.1032454 -0.6216957 -0.753235 0.0609045 0.0143975 0.2928121 -0.5968567 0.0224999 -0.0049406 0.0290947 -0.2312715 0.0976657 -0.0233867 -0.0061725 -0.4719356 -0.6034646 0.0594774 0.0332797 0.0432166 -0.1354035 -0.0985886 -0.1062117 0.0111693 -0.3526125 -0.281825 0.0325306 0.0356661 0.0251571 -0.0696431 1.6608955 -0.0559773 -0.0518969 0.0416343 0.7095186 -0.049586 -0.0609412 -0.0454268 0.1781989 -0.6545876 0.3692783 -0.0123603 0.7560366 0.4884435 -0.0813634 -0.0471094 -0.06686 -0.1025124 -0.0839297 -0.1091405 0.003964 0.3199514 0.1216961 -0.0459102 -0.0347951 -0.0300769 -0.254492 -0.3490923 -0.0504902 0.0153638 -0.3971739 0.1841011 -0.0074339 0.0458045 -0.0203383 -0.0639613 -0.0142827 0.014339 0.0302599 0.0180219 0.1040972 -0.0217346 -0.0171346 -0.0185945 0.0789403 -0.0166822 0.0104319 -0.0261083 0.02321 0.1101922 0.0145961 0.0195269 0.0118006 0.0728702 0.0451572 -0.0037293 0.0065402 0.0086183 0.1143657 0.00904 0.0054285 0.0095048 0.2180904 0.0783347 0.0211388 0.002187 0.0857791 0.0236599 0.0118336 -0.0035535 0.0142107 0.1898076 0.1314868 0.1222928 0.0092299 0.0378715 0.2449213 0.0049513 0.0163743 0.0002833 0.365866 unknown
polarizability: 165.6628657|-2.713951|114.7280041|-3.615346|-4.1362342|68.4827063 unknown
InChI: InChI=1S/C5H5NO4S2/c7-4(3-12(8,9)10)5-6-1-2-11-5/h1-2,8H,3H2
charge 0 multiplicity 1
17 atoms
S  2.682483 0.06924 -0.148507
S  -2.826669 -1.388427 0.188108
O  3.241922 1.850368 -0.319727
O  3.048883 -0.721217 -1.506754
O  3.143599 -0.488068 1.292853
O  0.28033 -1.6960 0.098102
N  -1.979102 1.138448 -0.06739
C  0.862393 0.678119 -0.134463
C  -0.097822 -0.498965 0.009273
C  -1.520239 -0.10961 0.027331
C  -3.999547 -0.052127 0.110522
C  -3.366775 1.183177 -0.021727
H  0.816727 1.386248 0.706997
H  0.747803 1.223448 -1.083566
H  -5.067098 -0.255219 0.166707
H  -3.874992 2.145052 -0.089357
H  4.238005 1.853835 -0.3977
