program: Gaussian 09
title: 000193163
version: EM64L-G09RevD.01
frameworkgroup: C1[X(C10H12N2O2)]
method: RPBEPBE
basis: SDD
operation: Freq
keyword: #p
keyword: freq=noraman
keyword: PBEPBE/SDD
title: #p freq=noraman PBEPBE/SDD
converged: YES YES NO NO
title: Mulliken charges:
elementType: O O N N C C C C C C C C C C H H H H H H H H H H H H
charge: -0.259651 -0.478860 -0.592556 -0.035150 -0.010788 -0.339101 -0.421282 0.228733 0.226792 -0.352834 -0.346572 -0.225645 -0.244407 -0.221612 0.213451 0.277317 0.217537 0.222659 0.191387 0.313945 0.345763 0.278068 0.293880 0.256033 0.228682 0.234213
chargesum: 0.00000
title: Mulliken charges with hydrogens summed into heavy atoms:
elementType: O O N N C C C C C C C C C C
charge: -0.259651 -0.133097 -0.020609 -0.035150 0.202664 0.155753 -0.007236 0.228733 0.226792 -0.038889 -0.090539 0.003037 -0.010194 -0.221612
polarizability: 1.57230534e+02 5.13353617e+00 1.57095495e+02 5.22918448e+00 -3.33240971e+00 7.05819379e+01
1716.lowfreq: -10.2794 -7.4608 -0.8263 -0.0005 0.0005 0.0009 23.1286 45.1632 69.8018
frequency: 23.0572 45.1468 69.7997 109.1875 125.5607 134.6125 169.9757 202.6748 221.4248 238.2469 262.5251 297.3947 360.7804 391.8641 407.0247 437.8252 481.1382 493.4454 504.0431 566.1062 566.8756 574.9288 598.4574 711.7208 744.8409 768.3311 790.8085 840.0842 876.1579 893.8122 946.5955 954.2506 977.6716 985.5647 1038.8365 1059.0383 1064.2683 1102.5548 1106.3205 1149.9400 1176.9595 1193.4092 1203.6153 1234.0642 1255.2373 1274.9908 1285.7099 1307.9712 1347.6168 1365.6684 1375.6180 1397.9703 1431.2038 1457.1407 1476.0893 1482.3136 1578.3284 1602.4315 1644.3590 2177.1793 2869.8686 2965.9729 3006.1364 3037.9101 3097.8199 3135.5664 3150.3370 3165.9656 3174.6694 3494.9948 3566.9906 3623.8805
redmass: 4.8335 4.9338 5.1793 4.4719 3.7049 5.3975 3.7352 1.7802 2.2323 2.2832 1.5362 2.3759 3.8988 4.3252 2.7552 5.7012 4.4685 3.7222 2.9134 3.3233 2.1425 4.5450 4.1173 5.3019 4.1327 1.2590 4.9155 2.9143 1.4207 2.0184 1.6590 1.3784 5.3777 1.3439 2.2111 2.1723 2.2287 2.5789 2.8547 1.6805 1.1901 1.8448 1.2704 2.7543 1.1978 1.1889 1.4604 1.2105 1.2876 1.4245 10.5016 1.5478 2.0932 1.1339 1.1126 2.3098 7.0167 6.0508 1.0949 12.6304 1.0719 1.0844 1.0614 1.0890 1.1033 1.0865 1.0905 1.0946 1.1005 1.0455 1.0661 1.0991
irintensity: 2.3669 1.4495 5.2507 0.8476 1.7716 0.0928 0.0912 15.4281 5.2255 2.9717 121.2531 60.7845 18.7654 0.5348 28.3314 3.1779 6.1636 8.2238 26.1071 59.0850 158.3121 1.0609 19.6817 4.8026 2.0810 102.4128 2.1359 15.0455 2.9612 20.6321 8.4042 7.1372 67.9649 1.1375 10.9865 68.5343 3.0905 45.2071 12.1382 7.6126 10.7268 10.5572 12.4537 145.8192 17.6143 51.5245 14.2611 27.6452 8.2900 2.7813 14.7249 9.7390 49.4060 16.4674 16.4951 97.7673 20.0033 59.3263 49.0607 42.0300 122.6775 21.5146 23.1075 38.1474 1.9568 6.6312 11.7362 1.3023 25.7062 2.2225 6.4165 5.1050
temp: 298.150 k
press: 1.00000 atm
elementType: 8 8 7 7 6 6 6 6 6 6 6 6 6 6 1 1 1 1 1 1 1 1 1 1 1 1
symmnumber: 1
zpe: 537427.6 jmol-1
zpe.correction: 0.204695 hartree
zpe.thermalcorrener: 0.218914 hartree
zpe.thermalcorrenthalpy: 0.219858 hartree
zpe.thermalcorrgfe: 0.162567 hartree
zpe.sumelectzpe: -647.131314 hartree
zpe.sumelectthermal: -647.117096 hartree
zpe.sumelectthermalent: -647.116152 hartree
zpe.sumelectthermalfe: -647.173443 hartree
dipole: 5.1861 -4.8574 -0.6732
dipole: 7.1374
quadrupole: -57.2707 -95.3938 -80.2398
quadrupole: 11.9624 -3.4544 1.9899
quadrupole: 20.3641 -17.7590 -2.6050 11.9624 -3.4544 1.9899
hfenergy: -647.3360098 hartree
pointgroup: C01 [X(C10H12N2O2)]
dipole: -1.729542 0.7344027 -2.0867791 debye
dipolederiv: -1.8864361 0.1011115 -0.0192044 -0.0141889 -0.2650639 0.0069259 0.2669184 -0.0675514 -0.2654815 -0.6607785 0.1823176 0.1548837 0.1480846 -0.3684582 0.1395248 0.1620161 0.1087221 -0.6539741 -0.7162387 -0.1141448 -0.044662 -0.1345544 -0.2354644 0.049979 -0.0541229 -0.0142234 -0.7637999 -0.2249107 -0.0033707 -0.0003183 0.0253931 -0.330797 0.1121604 -0.0530491 0.1138158 -0.4446982 0.2254073 -0.0221708 -0.1054749 0.0300332 0.2732477 -0.0975836 -0.1952341 -0.0486558 0.5102665 0.9432865 -0.1293281 0.0874556 -0.3066486 0.2942815 -0.0378329 0.3725828 -0.0035171 0.1584339 0.3403316 0.1041471 -0.0844472 0.081524 0.1965511 -0.0504456 -0.1362306 0.0022322 0.5208933 1.4622445 -0.0609831 -0.0494775 0.3130664 0.0748356 -0.0264994 -0.6811398 0.0373959 0.1525775 -0.1845064 -0.0978736 0.1845385 0.102399 0.0062469 0.072279 -0.0637273 0.0927178 -0.0967232 -0.3399671 0.0236762 0.007528 -0.2419626 -0.170188 0.0009294 0.4082834 -0.0527138 -0.1365236 0.073435 0.0934014 -0.1848272 -0.0482121 -0.0415976 -0.1314397 0.0451768 -0.1560244 0.1121013 0.2781138 -0.1029848 0.1013038 -0.0190183 -0.041414 -0.1334413 -0.0508458 -0.1313213 0.0779842 -0.0796078 0.0626067 -0.1250924 0.0809941 -0.2312182 0.0542625 -0.1462544 0.0625371 -0.2698463 -0.0328524 0.0354154 -0.0486486 -0.0314507 0.1739853 -0.2149062 0.077234 -0.2165965 0.3914463 0.0446022 0.0082851 0.0282265 -0.0060228 -0.1681156 0.0366309 0.01749 0.0241269 -0.0126337 0.0603572 0.0558525 0.0402715 0.059609 0.1034642 0.0212601 0.0263144 -0.0166435 0.0023943 -0.0297405 -0.0638066 -0.0152827 0.0354681 -0.0909547 0.0275694 -0.0555536 0.0888024 0.0760653 0.0823818 -0.0050766 0.0165501 0.0339169 -0.1453 0.0176956 0.0459548 -0.0122356 0.0463251 -0.0962833 -0.0350195 -0.0665606 -0.0507182 0.0333477 -0.0989976 -0.0872406 -0.0322965 -0.2993632 0.1567619 0.0381885 0.0058019 0.0624566 0.1468918 0.0470477 -0.0025784 0.0441657 0.1032922 0.2306289 -0.1405282 -0.152583 -0.1791603 0.2368845 -0.099357 -0.0947339 -0.0739019 0.1874071 0.2917489 -0.0223506 0.0937638 -0.015047 0.0375337 0.0119543 0.0908811 -0.0385447 0.2275225 0.0802273 0.0765683 0.1300792 0.0456065 0.1733145 0.0582712 0.0631148 0.0605763 0.2694244 -0.0050401 0.0492672 -0.0534193 0.0574441 0.1152528 0.0652771 -0.0690064 0.0609714 0.0740716 0.0790273 -0.0097671 0.0239805 -0.0141842 0.0815343 0.1156864 0.0459657 0.1168361 -0.0457677 -0.0921925 -0.0234328 0.0756152 -0.0148274 0.1411999 0.0530496 0.0677844 0.0513261 0.0786058 unknown
polarizability: 158.7736727|-1.8327583|90.590103|-6.3467669|-36.3090605|135.5441904 unknown
InChI: InChI=1S/C10H12N2O2/c11-5-8-3-1-2-4-10(8)14-7-9(13)6-12/h1-4,9,13H,6-7,12H2
charge 0 multiplicity 1
26 atoms
O  -0.491635 0.030213 0.888227
O  -1.944426 0.611534 -1.926921
N  -4.595324 0.024476 0.694496
N  1.518695 -1.630209 3.256818
C  -2.491478 0.150559 -0.635103
C  -1.677534 0.812442 0.47804
C  -3.992177 0.538563 -0.540094
C  0.754343 0.263859 0.307801
C  1.866921 -0.290409 1.016801
C  0.967499 0.977112 -0.896131
C  3.181057 -0.10865 0.507233
C  2.28304 1.152721 -1.376687
C  3.393344 0.616844 -0.681482
C  1.660347 -1.01926 2.237805
H  -2.387088 -0.951925 -0.536216
H  -2.305075 0.831617 1.383799
H  -1.387473 1.839309 0.184238
H  -4.067342 1.642349 -0.539684
H  -4.490343 0.186703 -1.477677
H  0.109978 1.335361 -1.471901
H  -2.370475 0.112499 -2.66827
H  -4.69188 -0.991749 0.753453
H  -5.41802 0.526217 1.031874
H  4.023447 -0.537243 1.059433
H  2.438258 1.702919 -2.311505
H  4.408642 0.756752 -1.065047
