program: Gaussian 09
title: 000193158
version: EM64L-G09RevD.01
frameworkgroup: C1[X(C18H13Cl2NO3)]
method: RPBEPBE
basis: SDD
operation: Freq
keyword: #p
keyword: freq=noraman
keyword: PBEPBE/SDD
title: #p freq=noraman PBEPBE/SDD
converged: YES YES NO NO
title: Mulliken charges:
elementType: Cl Cl O O O N C C C C C C C C C C C C C C C C C C H H H H H H H H H H H H H
charge: -0.046656 -0.053635 -0.260879 -0.411558 -0.232541 -0.118443 0.131258 -0.012155 0.190277 -0.480771 0.322119 0.340715 -0.473546 -0.382158 -0.366000 -0.388772 -0.377312 -0.215873 -0.211925 -0.221229 -0.217729 0.180330 -0.124038 -0.121489 0.258063 0.265427 0.268379 0.279019 0.268964 0.262836 0.263121 0.269428 0.261147 0.259219 0.258918 0.257098 0.380392
chargesum: 0.00000
title: Mulliken charges with hydrogens summed into heavy atoms:
elementType: Cl Cl O O O N C C C C C C C C C C C C C C C C C C
charge: -0.046656 -0.053635 -0.260879 -0.031167 -0.232541 -0.118443 0.131258 -0.012155 0.190277 0.042718 0.322119 0.340715 0.073852 -0.113194 -0.103165 -0.125652 -0.107884 0.045274 0.047294 0.037689 0.039369 0.180330 -0.124038 -0.121489
polarizability: 3.18277472e+02 2.01408191e+01 3.26125749e+02 -5.82281391e+00 -2.06907290e+01 1.14500905e+02
1716.lowfreq: -3.3109 -0.0021 -0.0019 -0.0014 0.6421 2.9645 9.4639 23.3628 30.8251
frequency: 9.3384 23.3348 30.8250 33.7872 39.3890 54.6898 62.4778 77.6690 107.5607 112.3638 153.4974 157.4375 173.8078 198.4577 216.1216 247.9330 272.4194 285.0294 313.9192 327.2578 380.2730 401.3938 406.2367 412.6849 443.1389 479.7136 489.4931 503.2508 509.4683 517.6450 572.5414 587.5932 622.5571 626.5717 636.4145 640.3928 695.2479 706.1139 708.4575 715.6343 732.9219 761.3325 787.2002 824.1869 835.2768 837.9375 841.5111 871.6000 927.7321 943.2450 955.2312 964.3696 969.6274 978.2709 991.2436 1000.5230 1011.9217 1024.4308 1037.6644 1073.0969 1075.3138 1086.2466 1103.3903 1109.1531 1129.4284 1144.4295 1160.2788 1187.2854 1191.5393 1201.7150 1246.5648 1267.2979 1296.6252 1299.0592 1325.0315 1348.4196 1358.7833 1371.0606 1391.5976 1400.1014 1402.5909 1439.0531 1457.2357 1462.2724 1489.4371 1552.7311 1567.1039 1576.3451 1581.9059 1605.1450 1609.0139 1665.7846 3001.7390 3020.7378 3044.7413 3076.4370 3149.4742 3156.1039 3158.2263 3158.4429 3172.2411 3175.1370 3178.0755 3179.4324 3516.4670
redmass: 9.0980 8.4530 10.4308 4.1770 8.6948 5.4516 5.5950 2.0590 6.3701 6.9659 5.2350 9.3551 10.2215 7.6485 10.1725 5.5647 9.0154 6.6100 7.4888 6.7323 6.3276 5.5430 2.9251 2.9760 5.9166 5.4604 4.3263 2.0257 3.8795 3.4097 5.1330 5.7804 6.9811 6.4516 2.4520 1.9231 5.5745 7.3420 6.1627 3.8312 4.3178 6.0717 1.5224 1.3111 1.3357 1.3957 1.5478 4.9159 8.2126 7.5283 1.3533 1.3447 1.3728 1.3483 6.4982 4.0647 4.6296 2.1363 3.3169 2.9757 2.7033 2.4667 2.0342 1.4487 2.4060 2.5139 1.2216 1.1364 1.1312 3.7733 1.5597 1.1109 1.2716 1.2655 2.1345 4.3652 5.1564 5.1016 2.0733 3.5103 3.5486 1.0840 1.1200 2.2828 2.9727 8.4054 7.6271 7.7131 8.2751 6.2615 7.0080 8.2474 1.0614 1.0618 1.0986 1.0991 1.0888 1.0885 1.0885 1.0886 1.0965 1.0968 1.0976 1.0979 1.0640
irintensity: 1.5360 0.0751 0.0372 0.1959 0.3802 0.1009 0.0590 0.0477 0.5294 1.7694 2.4700 1.3899 0.8109 3.3405 0.5961 0.8920 0.2558 0.2092 1.5101 0.6760 4.6721 5.8926 0.3481 0.0945 10.9062 22.2235 40.6121 39.3729 19.0503 18.5813 60.6359 7.8857 0.8632 5.7871 61.8538 66.8236 0.3866 6.9717 13.1304 4.2737 2.3407 1.1345 19.5856 28.1659 28.2634 64.2111 17.4780 5.6074 19.6218 49.4837 0.4762 0.4336 2.5875 1.2132 81.6076 28.3276 10.4773 14.1829 191.4931 59.7509 63.8290 93.5357 4.1409 2.4907 3.8586 3.2137 0.6205 1.9041 0.4022 9.1704 1.5376 3.6043 0.9208 0.1632 84.4822 15.8890 0.6736 21.6945 52.3456 4.9151 8.1091 21.1920 50.5160 58.8758 109.4405 57.8466 12.1396 12.7630 22.6421 6.0281 1.8154 198.3393 2.5518 8.1550 2.6165 6.2983 6.6182 1.6033 1.6829 2.1888 4.5759 3.4395 2.3828 0.7608 28.7900
temp: 298.150 k
press: 1.00000 atm
elementType: 17 17 8 8 8 7 6 6 6 6 6 6 6 6 6 6 6 6 6 6 6 6 6 6 1 1 1 1 1 1 1 1 1 1 1 1 1
symmnumber: 1
zpe: 696290.4 jmol-1
zpe.correction: 0.265203 hartree
zpe.thermalcorrener: 0.286873 hartree
zpe.thermalcorrenthalpy: 0.287817 hartree
zpe.thermalcorrgfe: 0.209104 hartree
zpe.sumelectzpe: -1892.590311 hartree
zpe.sumelectthermal: -1892.568641 hartree
zpe.sumelectthermalent: -1892.567697 hartree
zpe.sumelectthermalfe: -1892.646410 hartree
dipole: 1.6729 -0.4900 -0.3195
dipole: 1.7722
quadrupole: -146.2034 -168.2626 -150.8290
quadrupole: 3.1925 -4.2370 -3.7267
quadrupole: 8.8950 -13.1643 4.2693 3.1925 -4.2370 -3.7267
hfenergy: -1892.8555137 hartree
pointgroup: C01 [X(C18H13Cl2N1O3)]
dipole: 0.6769331 -0.0673114 0.152926 debye
polarizability: 305.4560251|-11.4231601|340.2407355|5.8073557|-12.1008647|113.2073652 unknown
InChI: InChI=1S/C18H13Cl2NO3/c19-13-5-1-11(2-6-13)17-18(12-3-7-14(20)8-4-12)24-15(21-17)9-10-16(22)23/h1-8,22H,9-10H2
charge 0 multiplicity 1
37 atoms
Cl -3.980438 5.491153 0.183179
Cl -4.358234 -4.688512 -0.580647
O  1.424788 1.326637 -0.00984
O  6.415606 -2.297735 0.43261
O  6.50779 -0.044261 -0.120779
N  1.402918 -0.949761 0.026834
C  0.057359 0.914488 -0.049402
C  0.056321 -0.48512 -0.052264
C  2.171696 0.127624 0.040713
C  3.660741 0.239241 0.083162
C  -0.927515 1.996711 -0.005458
C  -1.034489 -1.468051 -0.177477
C  4.317496 -1.144622 0.236865
C  -2.215385 1.805729 0.570489
C  -0.586855 3.287217 -0.501875
C  -2.244211 -1.18014 -0.867071
C  -0.850925 -2.771966 0.359549
C  -3.145696 2.862586 0.627546
C  -1.508744 4.351619 -0.447393
C  -3.256658 -2.153768 -0.992544
C  -1.85599 -3.753976 0.244873
C  5.827155 -1.05653 0.157151
C  -2.781073 4.122694 0.112205
C  -3.050634 -3.427281 -0.426012
H  3.961679 0.90561 0.913112
H  4.028974 0.731702 -0.836817
H  4.034827 -1.622136 1.191882
H  3.961467 -1.836366 -0.549177
H  -2.488029 0.835589 0.996367
H  0.406223 3.453984 -0.929441
H  -2.392552 -0.201448 -1.334073
H  0.093181 -3.00842 0.85911
H  -4.131235 2.711152 1.076779
H  -1.2428 5.339471 -0.833748
H  -4.181614 -1.929768 -1.531435
H  -1.711907 -4.753037 0.665791
H  7.405364 -2.217209 0.357735
