program: Gaussian 09
title: 000193131
version: EM64L-G09RevD.01
frameworkgroup: C1[X(C11H18N2O3S)]
method: RPBEPBE
basis: SDD
operation: Freq
keyword: #p
keyword: freq=noraman
keyword: PBEPBE/SDD
title: #p freq=noraman PBEPBE/SDD
converged: YES YES NO NO
title: Mulliken charges:
elementType: S O O O N N C C C C C C C C C C C H H H H H H H H H H H H H H H H H H
charge: 0.204606 -0.272844 -0.417808 -0.236641 -0.420564 -0.407281 -0.047600 -0.066661 -0.487861 -0.712992 -0.364896 -0.360047 0.177503 -0.399659 -0.134890 -0.713502 0.161213 0.240115 0.253445 0.274664 0.265210 0.254851 0.217070 0.209112 0.316269 0.319510 0.212290 0.215850 0.196812 0.216322 0.243896 0.241962 0.223563 0.223730 0.375254
chargesum: 0.00000
title: Mulliken charges with hydrogens summed into heavy atoms:
elementType: S O O O N N C C C C C C C C C C C
charge: 0.204606 -0.272844 -0.042554 -0.236641 -0.104295 -0.087771 0.192515 0.186783 -0.213197 -0.192932 0.061285 0.068093 0.177503 0.013475 0.109006 -0.024247 0.161213
polarizability: 1.84921537e+02 -2.24811996e+00 1.45510832e+02 9.92013300e-02 1.19921976e+00 1.24532356e+02
1716.lowfreq: -8.5809 0.0017 0.0017 0.0018 1.2961 7.3007 17.9500 28.8610 33.8965
frequency: 17.8239 28.3529 33.8815 44.5601 60.0166 91.4891 92.6490 124.5496 159.0633 169.5053 192.6936 211.0651 237.4388 261.0395 277.7079 308.5024 334.1331 346.8394 426.3001 437.8379 444.4098 481.8550 518.0120 542.0937 570.8495 573.5437 607.8536 629.7517 660.8418 689.6673 706.2409 710.9574 734.1831 770.3330 806.6846 828.7396 862.1965 884.8837 920.0960 968.3718 976.2060 986.1751 1012.8257 1029.9114 1043.3803 1053.3057 1060.5053 1064.3662 1087.5191 1094.9164 1103.4675 1121.7418 1153.8663 1161.0759 1170.8855 1219.9163 1229.9806 1243.8657 1252.4638 1255.2378 1268.7282 1276.4127 1295.6138 1300.2908 1301.5485 1325.2507 1338.2214 1349.6642 1358.5704 1361.6260 1379.2408 1387.3623 1395.1767 1444.8417 1455.1936 1457.7483 1473.4801 1476.6465 1481.3613 1658.0435 1701.1387 2945.4706 2962.3287 2971.4168 2979.8662 2982.9274 2987.4912 2996.6199 3007.1060 3024.9202 3027.4941 3037.4644 3052.5282 3085.9457 3098.3009 3105.7267 3508.7796 3629.8290 3633.4207
redmass: 6.1850 4.7117 10.2026 4.6083 6.7912 7.7012 3.7439 1.8843 4.2150 3.7437 1.3690 2.1668 3.8563 4.2690 2.9410 3.8079 1.1918 3.2524 3.6016 3.4692 1.1069 3.9780 4.0959 5.0583 3.9953 3.6942 1.2664 4.8607 3.8301 5.6698 11.4116 3.7238 1.5667 1.8877 3.0887 3.6228 1.5369 2.0169 1.8437 4.1027 2.9159 1.6649 3.0403 2.5209 2.3589 2.8406 1.5981 1.7598 2.0236 2.1173 2.3339 1.4286 1.2768 1.7188 1.4087 1.4217 1.3346 1.4732 1.5871 1.8460 1.3619 1.3196 1.1560 1.3279 1.3472 1.2854 1.4228 1.5957 1.5154 1.7069 1.6945 1.2454 2.2332 1.0929 1.0798 1.0825 1.0488 1.0885 1.0649 8.2117 7.3081 1.0610 1.0838 1.0592 1.0607 1.0832 1.0355 1.0971 1.0852 1.0964 1.0628 1.0886 1.1038 1.1003 1.1005 1.1056 1.0639 1.0781 1.0814
irintensity: 0.1548 1.5992 1.4512 1.0440 1.6997 1.3349 0.2831 0.1277 1.4294 2.9412 1.1354 1.2951 1.8960 2.5744 2.6901 0.0559 5.2113 3.0601 26.2295 35.7305 259.6907 6.6680 16.9928 4.2298 5.8214 4.6922 115.7208 1.2041 4.0737 10.7441 20.0560 34.9651 22.0319 0.4094 0.9761 6.8302 7.3560 4.8791 0.1927 4.0112 2.3140 8.0517 21.7236 175.7509 140.0201 14.4614 17.8006 11.4145 3.1746 8.6403 11.6663 0.9228 12.4790 4.0562 12.3671 8.8448 7.3552 22.3847 41.7120 49.5016 21.5060 14.9292 5.3135 0.8031 6.6168 24.0137 1.1551 3.8125 5.7714 12.3796 6.3462 14.8781 108.6365 4.2905 3.6663 5.7826 13.9119 13.0889 18.2110 195.5927 643.1065 13.5030 15.4553 1.6514 18.1459 89.4548 36.0092 8.7054 8.2071 1.0151 55.2636 7.4154 56.1179 32.7960 25.6022 11.7401 21.1861 80.0415 7.9067
temp: 298.150 k
press: 1.00000 atm
elementType: 16 8 8 8 7 7 6 6 6 6 6 6 6 6 6 6 6 1 1 1 1 1 1 1 1 1 1 1 1 1 1 1 1 1 1
symmnumber: 1
zpe: 751329.1 jmol-1
zpe.correction: 0.286166 hartree
zpe.thermalcorrener: 0.304229 hartree
zpe.thermalcorrenthalpy: 0.305173 hartree
zpe.thermalcorrgfe: 0.237069 hartree
zpe.sumelectzpe: -1161.917644 hartree
zpe.sumelectthermal: -1161.899582 hartree
zpe.sumelectthermalent: -1161.898637 hartree
zpe.sumelectthermalfe: -1161.966742 hartree
dipole: 4.3666 -3.7851 -2.4184
dipole: 6.2644
quadrupole: -130.7003 -104.5011 -112.3553
quadrupole: 18.4337 10.4994 4.0233
quadrupole: -14.8481 11.3512 3.4969 18.4337 10.4994 4.0233
hfenergy: -1162.2038106 hartree
pointgroup: C01 [X(C11H18N2O3S1)]
dipole: -1.7441077 1.5583148 -0.7772 debye
polarizability: 184.9996033|-1.4027693|145.4113464|0.1377951|1.3710258|124.553775 unknown
InChI: InChI=1S/C11H18N2O3S/c1-6(10(14)15)3-2-4-8-9-7(5-17-8)12-11(16)13-9/h6-9,12-14H,2-5H2,1H3
charge 0 multiplicity 1
35 atoms
S  1.448377 0.73811 1.667019
O  5.530147 -1.446217 0.269172
O  -5.396222 -1.209388 1.154489
O  -4.089479 -1.813269 -0.663083
N  3.293117 -1.20099 -0.515432
N  4.452507 0.651368 -0.068544
C  2.324041 -0.141224 -0.80352
C  3.148077 1.18065 -0.475063
C  1.030874 -0.210792 0.0654
C  2.4186 1.984191 0.632612
C  -0.210286 0.360047 -0.651792
C  -1.524892 0.154351 0.128306
C  4.536211 -0.746638 -0.059974
C  -2.74164 0.765651 -0.601268
C  -4.083442 0.546376 0.134549
C  -5.240231 1.368152 -0.505422
C  -4.474291 -0.927223 0.132667
H  2.027847 -0.156669 -1.872274
H  3.242972 1.815992 -1.378154
H  0.843891 -1.254532 0.378512
H  3.125813 2.503198 1.299149
H  1.72175 2.719591 0.194609
H  -0.060506 1.440201 -0.856623
H  -0.300483 -0.13948 -1.64084
H  3.099463 -2.194646 -0.603789
H  5.234456 1.222181 0.240297
H  -1.42205 0.607476 1.13464
H  -1.690252 -0.932008 0.272637
H  -2.588711 1.857127 -0.720791
H  -2.820317 0.333932 -1.618445
H  -3.988902 0.856066 1.193457
H  -6.192148 1.198838 0.025965
H  -5.000579 2.445177 -0.456857
H  -5.375022 1.093127 -1.56729
H  -5.657392 -2.169226 1.103677
