program: Gaussian 09
title: 000193128
version: EM64L-G09RevD.01
frameworkgroup: C1[X(C11H15NO3)]
method: RPBEPBE
basis: SDD
operation: Freq
keyword: #p
keyword: freq=noraman
keyword: PBEPBE/SDD
title: #p freq=noraman PBEPBE/SDD
converged: YES YES NO NO
title: Mulliken charges:
elementType: O O O N C C C C C C C C C C C H H H H H H H H H H H H H H H
charge: -0.293502 -0.473598 -0.300995 -0.361282 -0.593599 0.505952 -0.297312 -0.417633 -0.369316 -0.352959 -0.222758 -0.229806 0.302855 -0.243058 -0.303238 0.255652 0.211419 0.236918 0.229888 0.226479 0.231891 0.234403 0.244709 0.222506 0.222650 0.344592 0.199613 0.208873 0.225686 0.354971
chargesum: 0.00000
title: Mulliken charges with hydrogens summed into heavy atoms:
elementType: O O O N C C C C C C C C C C C
charge: -0.293502 -0.118627 -0.300995 -0.016690 -0.126528 0.505952 0.169493 -0.191154 -0.137424 0.126153 -0.000251 -0.007156 0.302855 -0.017372 0.105248
polarizability: 1.64167126e+02 -2.40082214e-01 1.40975450e+02 -1.84795997e+01 -2.65380763e+00 9.10702983e+01
1716.lowfreq: -6.6895 0.0003 0.0006 0.0007 5.9255 7.8482 19.8340 26.6459 33.1392
frequency: 18.6580 26.3519 33.0259 57.7427 72.2947 88.3795 108.1510 125.1422 205.5091 238.4821 276.8258 300.2750 332.6572 342.9607 402.2407 404.9542 466.3939 490.0237 512.0492 567.5234 618.2567 636.2310 660.6284 697.3216 704.0357 752.8454 769.3351 804.2673 841.5714 850.5855 891.2763 910.4393 936.8778 960.6981 972.9801 990.3908 991.9073 1009.6588 1028.7854 1043.9363 1045.0039 1072.6011 1090.1889 1120.4271 1171.2255 1174.5276 1188.2301 1193.2804 1204.7756 1216.2392 1221.3711 1254.4338 1278.3266 1327.2803 1331.3417 1361.1970 1370.9263 1383.3239 1401.7704 1440.1283 1443.4359 1460.0895 1467.4942 1470.7731 1485.1925 1489.4113 1593.6184 1615.6299 1661.6219 2958.7341 2991.7075 2993.0449 3021.9822 3023.9058 3056.0834 3085.1855 3104.7251 3111.7975 3121.3507 3133.5039 3144.4567 3161.4334 3564.2777 3588.3192
redmass: 5.2078 4.2732 4.0053 5.1722 4.9177 4.7373 4.4396 3.8669 3.7545 5.8678 1.1516 3.6139 2.4208 2.4296 2.7592 2.6922 2.8393 4.0812 2.8318 2.7008 6.2424 3.0287 1.3441 10.6317 1.7200 2.9072 2.1478 2.8867 2.2230 1.2683 3.2735 1.4716 2.3590 2.5047 1.3947 5.9630 1.3238 3.1096 2.0970 3.1178 2.3296 1.7427 1.6059 2.7425 1.0563 1.4794 1.1311 1.2685 1.2002 2.0700 1.6879 1.1643 1.2137 1.2764 1.3836 1.2651 1.3259 6.4732 1.4593 2.0058 1.1571 1.0849 1.1102 1.0830 2.3216 1.9722 6.0604 6.1761 9.2364 1.0554 1.0706 1.0616 1.0598 1.1034 1.0995 1.0971 1.1067 1.0870 1.0859 1.0915 1.0962 1.1016 1.0772 1.0668
irintensity: 0.2822 1.2346 0.5528 1.3529 7.8102 5.1082 5.0968 7.2202 5.2690 0.5830 145.2802 7.8907 18.4416 25.3583 2.3143 3.4499 6.1875 10.8581 11.5822 17.9870 0.6126 36.1796 129.4401 30.9105 39.2061 18.2063 22.0618 3.8731 15.5073 1.4038 17.6143 1.4309 16.6327 26.5660 0.1418 2.7547 0.0143 99.6456 12.5581 72.1099 26.3323 1.7271 23.9799 114.2880 1.4470 101.5150 3.9217 63.3286 42.5464 6.8311 64.5739 13.8831 97.2782 0.8671 7.0518 14.2789 0.7889 1.7561 0.3859 10.0464 6.1308 31.9635 17.7710 5.2491 59.0671 298.1555 0.6628 5.9683 274.6804 70.2300 14.0841 19.9233 44.1332 88.4250 16.3654 7.8319 16.2314 9.2406 1.3144 19.0491 51.2054 19.5375 53.3437 5.8396
temp: 298.150 k
press: 1.00000 atm
elementType: 8 8 8 7 6 6 6 6 6 6 6 6 6 6 6 1 1 1 1 1 1 1 1 1 1 1 1 1 1 1
symmnumber: 1
zpe: 644404.6 jmol-1
zpe.correction: 0.245441 hartree
zpe.thermalcorrener: 0.260670 hartree
zpe.thermalcorrenthalpy: 0.261614 hartree
zpe.thermalcorrgfe: 0.199601 hartree
zpe.sumelectzpe: -707.457809 hartree
zpe.sumelectthermal: -707.442579 hartree
zpe.sumelectthermalent: -707.441635 hartree
zpe.sumelectthermalfe: -707.503648 hartree
dipole: 2.3051 1.0735 1.5197
dipole: 2.9624
quadrupole: -62.8460 -88.4352 -89.5396
quadrupole: 7.6915 1.6548 -3.7117
quadrupole: 17.4275 -8.1616 -9.2660 7.6915 1.6548 -3.7117
hfenergy: -707.7032493 hartree
pointgroup: C01 [X(C11H15N1O3)]
dipole: -0.8692276 0.6523307 -0.4210177 debye
polarizability: 164.0581016|3.9056425|134.1562935|-17.8394324|17.7797833|97.9984793 unknown
InChI: InChI=1S/C11H15NO3/c13-8-7-12-11(14)15-9-6-10-4-2-1-3-5-10/h1-5,12-13H,6-9H2
charge 0 multiplicity 1
30 atoms
O  -0.641867 -0.409337 -1.036149
O  -4.380994 2.415123 -0.072288
O  -1.990947 -1.928643 0.174932
N  -2.454387 0.375995 0.083981
C  1.290416 -1.806374 -0.247933
C  2.259947 -0.662006 0.003104
C  0.271727 -1.528255 -1.376175
C  3.531515 -0.641927 -0.626368
C  1.908235 0.422044 0.848672
C  -3.676164 0.341618 0.890497
C  4.427952 0.431874 -0.422436
C  2.800764 1.497609 1.056063
C  -1.734482 -0.755533 -0.21181
C  4.06459 1.507151 0.420756
C  -4.832314 1.028852 0.160106
H  0.722341 -2.06123 0.665448
H  1.85004 -2.716236 -0.542173
H  -0.333158 -2.432507 -1.569474
H  0.770354 -1.18929 -2.298589
H  3.823777 -1.477227 -1.275922
H  0.930595 0.421452 1.344654
H  -3.513477 0.855088 1.8583
H  -3.918367 -0.715175 1.094839
H  5.407663 0.427134 -0.914039
H  2.512871 2.325779 1.713973
H  -2.165668 1.270947 -0.315447
H  -5.741452 1.00669 0.796287
H  -5.039027 0.512991 -0.799988
H  4.758667 2.339304 0.584619
H  -5.05945 2.912589 -0.591839
