program: Gaussian 09
title: 000193127
version: EM64L-G09RevD.01
frameworkgroup: C1[X(C20H22F3NO5)]
method: RPBEPBE
basis: SDD
operation: Freq
keyword: #p
keyword: freq=noraman
keyword: PBEPBE/SDD
title: #p freq=noraman PBEPBE/SDD
converged: YES YES NO NO
title: Mulliken charges:
elementType: F F F O O O O O N C C C C C C C C C C C C C C C C C C C C H H H H H H H H H H H H H H H H H H H H H H
charge: -0.164650 -0.167491 -0.169326 -0.342278 -0.366718 -0.276290 -0.254577 -0.474835 -0.511716 0.312020 0.045159 0.469809 -0.497902 0.317640 -0.373752 -0.257072 -0.271634 -0.428696 -0.311064 -0.230630 0.205499 -0.353484 -0.392916 -0.206139 -0.221332 -0.257368 0.241194 -0.326270 -0.292498 0.370211 0.300566 0.274446 0.223608 0.233554 0.236382 0.255396 0.269756 0.208973 0.225620 0.272956 0.227258 0.259016 0.266752 0.253346 0.236798 0.239779 0.215105 0.201302 0.213380 0.195656 0.377458
chargesum: 0.00000
title: Mulliken charges with hydrogens summed into heavy atoms:
elementType: F F F O O O O O N C C C C C C C C C C C C C C C C C C C C
charge: -0.164650 -0.167491 -0.169326 -0.342278 -0.366718 -0.276290 -0.254577 -0.097377 -0.141505 0.312020 0.045159 0.469809 -0.197337 0.317640 -0.099307 0.200090 0.220144 -0.158941 -0.038108 0.203963 0.205499 0.132790 -0.126164 0.047208 0.015466 -0.017589 0.241194 0.090137 0.116538
polarizability: 2.97540829e+02 -8.22433216e-01 3.40012017e+02 1.28247277e+00 1.99087297e+01 1.51881330e+02
1716.lowfreq: -11.8398 -3.4750 -0.0008 -0.0007 0.0006 2.1475 3.4910 11.8688 21.1987
frequency: -11.0357 11.4515 21.1846 33.5932 38.1837 42.9048 47.9855 55.8408 63.2556 72.5897 82.4962 112.0110 123.8308 128.1546 139.0691 145.4110 183.6927 190.1108 225.2158 234.6206 246.3611 260.5977 274.7991 295.0054 301.0338 310.2044 332.7420 339.3471 359.3820 370.2303 375.7548 395.2841 428.1912 434.8370 460.0057 479.7710 489.6548 503.7860 519.0919 522.5462 537.3585 577.4985 605.0881 614.3976 636.4048 654.5624 666.6942 674.1655 692.5520 702.3251 716.9677 730.7026 753.1527 757.4434 767.3999 778.1171 807.1757 827.3454 842.9800 853.8362 869.1576 875.0032 900.6280 911.8119 919.3582 920.1575 974.9913 978.7447 981.3323 983.3359 986.2841 988.3809 996.2901 998.2692 1011.5348 1022.3008 1046.3489 1052.9104 1058.3977 1064.6481 1070.7460 1078.2930 1090.3678 1108.7162 1110.2572 1112.3277 1180.0552 1189.4230 1195.9478 1207.8357 1209.6436 1216.8140 1228.5784 1259.3431 1260.2002 1278.4547 1281.4400 1296.3322 1314.9519 1331.3932 1339.0403 1346.6709 1360.3973 1364.5213 1370.5003 1370.9631 1376.5797 1398.8113 1413.4810 1432.6518 1434.3241 1441.2045 1453.5242 1455.6191 1458.2429 1462.5392 1469.6559 1475.9035 1482.5245 1531.9815 1587.2021 1600.5232 1607.8135 1622.6039 1632.0504 2943.0109 2958.5389 2971.7478 2990.2046 3002.6170 3024.0997 3024.6920 3056.1092 3061.9155 3069.9671 3077.0887 3104.0199 3138.8524 3141.6278 3154.6316 3161.1115 3170.2676 3177.3956 3181.1350 3183.9162 3322.8080 3391.0361
redmass: 17.8694 4.9034 7.1410 7.2885 6.0689 5.6463 5.5973 4.7414 7.4737 4.1173 5.0090 4.4629 4.0306 4.6636 6.0114 4.3306 5.7831 4.6889 4.7110 5.8854 5.5950 4.0345 3.8399 2.3333 6.9466 6.2547 7.6191 3.7588 3.5139 5.8873 3.7733 3.3743 4.2190 4.0051 2.8130 5.4736 6.1818 2.3250 5.0486 4.5881 1.9266 6.6954 9.2406 7.0767 6.1355 5.1953 1.0635 4.6925 2.8610 3.5393 2.1408 3.3664 2.4530 2.6715 3.2585 1.5713 1.5348 4.1779 4.2992 3.0195 1.4721 2.2750 3.3184 1.6808 1.8345 1.9546 2.8476 2.1480 6.8175 2.2287 1.7108 2.1546 1.3958 2.5110 5.7588 3.2490 2.8475 2.2742 2.5792 3.0267 2.3621 3.1372 3.5254 2.2765 1.7465 2.8652 1.0716 1.1024 1.0859 1.7539 1.2157 3.0281 1.1462 1.4724 1.2188 1.3005 1.8484 1.1213 1.5198 1.2251 1.8712 1.2361 1.4770 1.2861 1.8476 1.9395 1.2583 7.1375 1.1918 2.4328 1.2047 1.0831 3.1529 1.0948 1.0847 1.0881 1.0877 2.5518 2.5328 2.7054 4.6569 3.8709 7.9458 4.2120 6.0295 1.0665 1.0642 1.0651 1.0613 1.0620 1.0929 1.0611 1.0954 1.0986 1.1025 1.1036 1.1064 1.0870 1.0890 1.0897 1.0918 1.0941 1.0969 1.0980 1.0947 1.0694 1.0771
irintensity: 0.1326 0.4539 0.4453 1.8026 0.2963 0.7282 3.1467 1.2707 2.8436 14.0521 1.7583 4.0802 4.6369 3.3811 0.3174 2.4671 3.5009 3.6089 6.1682 3.6251 3.9878 3.8710 1.2428 2.7488 4.1453 0.5456 4.9001 4.7547 24.6299 1.3526 6.9967 7.2700 5.3953 2.6615 7.2898 8.7876 2.4796 19.0612 12.6873 7.5479 7.3144 3.6123 18.1471 10.1688 8.1272 4.7003 99.8754 18.6010 4.5579 20.9319 28.7206 5.4214 49.8141 66.9559 31.3087 29.2516 110.8623 33.6996 3.5967 32.4497 10.2453 17.7155 55.0599 23.0791 50.6650 13.8442 52.2156 73.5380 125.6706 32.2108 38.2308 107.8807 1.3733 104.2347 130.1800 57.9841 4.6063 26.0289 31.9324 122.4449 38.4474 26.4556 25.7796 46.0591 3.8697 47.4510 7.4347 7.4510 1.2650 23.4339 25.5824 238.0808 6.3319 22.5520 4.5763 74.9048 121.7750 20.6528 65.1804 18.9090 90.2382 2.6059 34.8139 1.4497 54.0563 79.6815 0.9320 7.4443 37.8279 76.4847 15.6080 10.2749 28.8189 12.6435 7.8674 21.5354 1.8528 267.2659 95.3509 112.9471 68.0281 474.2797 221.1219 33.2142 79.2327 104.6684 30.3935 51.7355 34.7181 22.7219 47.2328 31.1060 37.1024 44.8345 26.3499 25.3740 5.6194 5.3159 6.7518 3.4387 3.3043 12.7208 7.8991 6.2850 2.3315 392.8392 199.4935
temp: 298.150 k
press: 1.00000 atm
elementType: 9 9 9 8 8 8 8 8 7 6 6 6 6 6 6 6 6 6 6 6 6 6 6 6 6 6 6 6 6 1 1 1 1 1 1 1 1 1 1 1 1 1 1 1 1 1 1 1 1 1 1
symmnumber: 1
zpe: 1030005.8 jmol-1
zpe.correction: 0.392308 hartree
zpe.thermalcorrener: 0.419445 hartree
zpe.thermalcorrenthalpy: 0.420390 hartree
zpe.thermalcorrgfe: 0.331491 hartree
zpe.sumelectzpe: -1503.543183 hartree
zpe.sumelectthermal: -1503.516046 hartree
zpe.sumelectthermalent: -1503.515102 hartree
zpe.sumelectthermalfe: -1503.604001 hartree
dipole: -1.7878 2.0266 -1.7230
dipole: 3.2050
quadrupole: -197.0260 -171.9553 -168.3768
quadrupole: 6.1082 2.4839 2.5553
quadrupole: -17.9066 7.1641 10.7426 6.1082 2.4839 2.5553
hfenergy: -1503.9354916 hartree
pointgroup: C01 [X(C20H22F3N1O5)]
dipole: -0.5074527 -0.564789 -1.0067283 debye
polarizability: 338.9469993|9.2555482|283.8344438|7.6764909|47.4058623|166.6527325 unknown
InChI: InChI=1S/C20H22F3NO5/c21-20(22,23)15-4-3-5-16(14-15)24-18-7-2-1-6-17(18)19(26)29-13-12-28-11-10-27-9-8-25/h1-7,14,24-25H,8-13H2
charge 0 multiplicity 1
51 atoms
F  2.286232 4.566469 3.331019
F  0.809159 5.553662 1.92699
F  0.073534 4.073274 3.472536
O  1.117627 -3.669233 0.012522
O  -1.394974 -1.857889 -0.840383
O  3.413556 -1.701433 -0.631767
O  -3.60758 -2.525526 -0.514305
O  3.468712 -4.921404 -0.703324
N  -0.759296 0.677353 -0.318128
C  -2.136392 0.931198 -0.285908
C  -3.089303 -0.150036 -0.387632
C  0.31434 1.468906 0.149364
C  0.174691 2.493833 1.123255
C  1.316148 3.194502 1.57123
C  -2.642888 2.263729 -0.196369
C  -0.315378 -3.988797 -0.037376
C  -1.061264 -3.275268 -1.168962
C  1.621552 1.150228 -0.322299
C  -4.484057 0.145081 -0.333731
C  1.480629 -2.469108 0.79809
C  -2.774255 -1.588518 -0.5592
C  2.988566 -2.23121 0.675141
C  2.610725 2.889632 1.092946
C  2.748969 1.84445 0.153149
C  -4.021899 2.52061 -0.157747
C  -4.959282 1.45736 -0.208319
C  1.130658 4.312577 2.556588
C  3.388527 -2.634503 -1.779029
C  4.14015 -3.960557 -1.582145
H  -0.522621 -0.263567 -0.662055
H  -0.796898 2.713046 1.571291
H  -1.943906 3.103063 -0.205396
H  -0.796106 -3.786604 0.940307
H  -0.35588 -5.076109 -0.229978
H  -0.434003 -3.225192 -2.074336
H  -2.008356 -3.80166 -1.38319
H  1.764568 0.338355 -1.044101
H  1.214305 -2.63958 1.863563
H  0.920902 -1.591694 0.427638
H  -5.176738 -0.699826 -0.400735
H  3.266315 -1.433891 1.386765
H  3.545565 -3.152907 0.929521
H  3.482347 3.43914 1.458307
H  3.739498 1.561642 -0.215789
H  -4.369192 3.558194 -0.101334
H  -6.034011 1.657338 -0.169892
H  3.87684 -2.055933 -2.583484
H  2.339107 -2.841191 -2.076211
H  5.145148 -3.763377 -1.161471
H  4.276285 -4.419681 -2.586144
H  2.529122 -4.622652 -0.520581
