program: Gaussian 09
title: 000193113
version: EM64L-G09RevD.01
frameworkgroup: C1[X(C16H32O4)]
method: RPBEPBE
basis: SDD
operation: Freq
keyword: #pfreq=noraman
keyword: PBEPBE/SDD
title: #p freq=noraman PBEPBE/SDD
converged: YES YES NO NO
title: Mulliken charges:
elementType: O O O O C C C C C C C C C C C C C C C C H H H H H H H H H H H H H H H H H H H H H H H H H H H H H H H H
charge: -0.430392 -0.430759 -0.418128 -0.230294 -0.110070 -0.111939 -0.473821 -0.474404 -0.365689 -0.382943 -0.361769 -0.385459 -0.372837 -0.368391 -0.352477 -0.376375 -0.356757 -0.487887 -0.695649 0.170992 0.244389 0.244662 0.183012 0.215166 0.214393 0.183243 0.197602 0.221039 0.191860 0.188318 0.218056 0.196183 0.198152 0.199862 0.185620 0.187067 0.190926 0.190580 0.190365 0.189995 0.219119 0.218241 0.321513 0.321733 0.193851 0.194365 0.251917 0.252002 0.210532 0.215369 0.210480 0.375440
chargesum: 0.00000
title: Mulliken charges with hydrogens summed into heavy atoms:
elementType: O O O O C C C C C C C C C C C C C C C C
charge: -0.108880 -0.109026 -0.042688 -0.230294 0.134318 0.132723 -0.075644 -0.076767 0.052953 -0.002766 0.052470 0.012555 -0.000150 0.013115 0.027883 0.060985 0.031458 0.016031 -0.059268 0.170992
polarizability: 2.41164152e+02 3.40360457e+00 1.72930994e+02 9.86659383e-01 3.30431309e+00 1.52080381e+02
1716.lowfreq: -25.7399 -11.7728 -3.8616 -0.0016 0.0010 0.0015 3.1838 8.1242 17.5722
frequency: -23.1252 7.0001 17.1983 19.5064 26.0684 36.7475 41.1922 53.4409 76.0231 83.1471 88.2044 100.4766 106.4361 113.7772 126.2756 136.6221 143.4235 149.3323 161.7907 189.3300 202.1357 222.9675 267.8020 278.0705 280.9407 297.0012 314.7476 361.2950 385.7364 396.5048 437.6830 438.5068 488.7505 499.8332 503.1549 522.5029 588.1315 634.2333 637.2392 722.0422 722.2331 731.3236 737.8764 755.5119 775.9913 799.9282 829.7723 856.5415 858.8044 887.1913 890.8499 918.5459 958.6489 985.8778 990.3415 995.5572 1001.3106 1011.0810 1030.4138 1035.8406 1053.0763 1064.9655 1067.8779 1071.6261 1077.0497 1079.3951 1081.8210 1083.4543 1100.4069 1115.6241 1118.1145 1150.6906 1187.3994 1197.8985 1203.7459 1216.8684 1225.6336 1232.8613 1237.5093 1253.6801 1257.9759 1262.6631 1272.3375 1277.6975 1283.3346 1285.6678 1286.4444 1290.8133 1291.9333 1297.9273 1300.6805 1311.1605 1325.7786 1341.4263 1343.3167 1352.3557 1355.0418 1356.1582 1359.8498 1360.4158 1371.5476 1373.8433 1387.0424 1436.6730 1447.3300 1450.2285 1460.8991 1461.7888 1462.6604 1464.0882 1468.6514 1472.7435 1475.7733 1478.6837 1481.3827 1486.2440 1487.3518 1669.5117 2938.8571 2943.1174 2947.1505 2947.7108 2950.7740 2954.0723 2961.5687 2965.3255 2971.1219 2971.2329 2971.7492 2984.9856 2985.5201 2986.1013 2989.6194 2991.0920 2995.2689 2995.8399 3001.3043 3022.9352 3025.8198 3031.6584 3040.2956 3043.1219 3047.5963 3051.4632 3061.6984 3068.1284 3070.4980 3510.4607 3538.2612 3539.3814
redmass: 1.7368 4.9008 4.8020 3.2395 3.3292 2.4343 4.4696 3.7175 3.5030 2.6805 2.6838 2.4589 2.4170 2.0614 4.6270 2.2593 2.1347 2.2944 4.0617 3.7930 4.8897 1.1204 2.5567 4.1274 1.2768 2.4055 1.1944 4.3424 3.8626 3.5303 3.0054 3.5418 3.2554 1.7815 2.9360 2.7272 4.6615 3.4771 1.3194 1.0753 1.0670 1.1123 1.1271 1.2718 1.3600 1.6188 1.8234 3.7274 1.8050 1.6474 1.6362 1.7539 1.9914 1.3373 1.8046 3.7638 4.0596 3.6421 3.3852 2.9297 2.7871 2.6399 1.3123 1.4704 1.8772 2.3179 2.0962 2.1850 3.0387 1.4740 2.5613 2.6681 1.7252 1.5693 1.2621 1.3420 1.3935 1.4526 1.3774 1.4019 1.3145 1.3731 1.3185 1.0569 1.0356 1.1829 1.1809 1.1680 1.2243 1.1321 1.1523 1.3735 1.3950 1.4242 1.2399 1.5206 1.6487 1.6246 1.5437 1.2573 1.8358 1.4764 1.2177 1.0848 1.0855 1.0844 1.0770 1.0683 1.0648 1.0764 1.0879 1.0735 1.0430 1.0972 1.0813 1.0999 1.0879 8.2279 1.0585 1.0589 1.0589 1.0589 1.0589 1.0590 1.0595 1.0596 1.0616 1.0523 1.0468 1.0964 1.0936 1.0635 1.0963 1.0959 1.0597 1.1010 1.1016 1.1025 1.1038 1.1002 1.0946 1.1022 1.0965 1.0892 1.1032 1.1007 1.0993 1.0639 1.0656 1.0657
irintensity: 0.1958 1.4899 0.0349 0.2090 0.0100 0.5330 0.0826 0.1807 0.6105 0.4215 0.6381 1.0117 0.1024 0.1774 1.2070 0.1661 0.1177 0.1543 0.1007 0.3365 5.7725 0.0045 16.1464 16.0291 25.2169 31.5138 278.7222 4.8816 2.2287 24.4908 4.7708 3.3098 9.0888 28.2484 2.4065 57.7486 13.2680 5.6788 129.2693 22.8607 6.1545 0.0894 0.1955 4.4121 1.5106 3.2779 5.5012 2.0447 12.7198 2.9730 2.5817 62.1131 2.4661 39.9313 9.0176 45.6256 5.5462 50.5223 9.7025 135.8926 33.5602 23.0059 4.1693 40.2788 17.6679 9.7767 1.7744 0.6496 23.9276 0.0895 8.8795 2.8710 7.1236 9.4142 26.4168 17.9697 10.0700 2.6343 2.9411 1.0549 7.5872 3.1743 5.1709 0.5418 0.7807 0.6881 3.0290 4.9779 11.9460 0.3333 2.2037 6.5109 10.7830 7.9933 26.2978 14.0994 0.6646 0.4289 3.8881 2.0672 27.2623 29.1137 10.6839 27.5526 2.0562 2.9671 0.1021 0.0336 0.5192 0.4812 2.3776 1.4924 12.3753 0.6576 2.9839 24.7982 23.6654 208.5927 32.2668 4.2038 11.1581 14.5470 19.8114 7.6171 37.4594 45.4454 81.7116 17.0963 91.1986 5.5143 9.1426 5.8232 19.9365 12.1475 39.4227 2.6171 0.2909 12.9353 13.8513 1.0236 51.5135 8.0208 145.6088 47.1732 88.6350 94.4167 54.6113 18.1578 4.1833 3.6760
temp: 298.150 k
press: 1.00000 atm
elementType: 8 8 8 8 6 6 6 6 6 6 6 6 6 6 6 6 6 6 6 6 1 1 1 1 1 1 1 1 1 1 1 1 1 1 1 1 1 1 1 1 1 1 1 1 1 1 1 1 1 1 1 1
symmnumber: 1
zpe: 1201061.3 jmol-1
zpe.correction: 0.457460 hartree
zpe.thermalcorrener: 0.482993 hartree
zpe.thermalcorrenthalpy: 0.483937 hartree
zpe.thermalcorrgfe: 0.395509 hartree
zpe.sumelectzpe: -928.134311 hartree
zpe.sumelectthermal: -928.108778 hartree
zpe.sumelectthermalent: -928.107834 hartree
zpe.sumelectthermalfe: -928.196262 hartree
dipole: 0.4229 4.3479 0.1887
dipole: 4.3725
quadrupole: -133.4727 -139.5476 -126.1014
quadrupole: -4.1077 -8.0831 -1.3580
quadrupole: -0.4321 -6.5070 6.9391 -4.1077 -8.0831 -1.3580
hfenergy: -928.5917713 hartree
pointgroup: C01 [X(C16H32O4)]
dipole: 0.3066322 -1.6534931 -0.3623271 debye
polarizability: 241.2020961|2.7270234|171.1957268|-2.1209252|6.4339662|153.7777034 unknown
InChI: InChI=1S/C16H32O4/c1-2-3-4-8-11-14(17)15(18)12-9-6-5-7-10-13-16(19)20/h14-15,17-19H,2-13H2,1H3
charge 0 multiplicity 1
52 atoms
O  1.429753 2.317318 1.964286
O  2.912989 2.583349 -1.49168
O  -8.873172 -2.584557 -0.578323
O  -8.652043 -0.481692 0.379116
C  1.431168 2.278942 0.484428
C  2.892188 2.246403 -0.050014
C  0.523808 1.147212 -0.043744
C  3.654498 0.932738 0.224769
C  -0.968767 1.371248 0.28496
C  -1.866467 0.190294 -0.145412
C  5.164839 1.041311 -0.081719
C  -3.364669 0.426541 0.149839
C  5.912682 -0.302969 0.058489
C  -4.263323 -0.756133 -0.275975
C  7.425728 -0.189353 -0.234701
C  -5.760014 -0.507975 0.012456
C  8.177072 -1.534856 -0.114607
C  -6.64004 -1.69505 -0.422717
C  9.687483 -1.40996 -0.40981
C  -8.115351 -1.479084 -0.149942
H  1.002613 3.257197 0.201694
H  3.430081 3.089921 0.418882
H  0.638533 1.067898 -1.146186
H  0.855469 0.174397 0.378718
H  3.211891 0.111617 -0.378928
H  3.524864 0.645198 1.290506
H  -1.314782 2.298103 -0.217386
H  -1.074975 1.547784 1.373466
H  -1.532562 -0.732976 0.373796
H  -1.733652 0.00107 -1.231827
H  5.294846 1.4366 -1.108628
H  5.620131 1.788729 0.600402
H  -3.700082 1.347143 -0.371349
H  -3.499095 0.617974 1.234578
H  5.767616 -0.70389 1.084198
H  5.462908 -1.047481 -0.63229
H  -3.930527 -1.675318 0.250791
H  -4.121084 -0.949578 -1.360185
H  7.571377 0.219625 -1.256495
H  7.880846 0.546467 0.460877
H  -5.909213 -0.316487 1.092348
H  -6.096569 0.408672 -0.508822
H  1.71817 1.42944 2.29989
H  2.547677 1.812427 -1.998082
H  7.722542 -2.269038 -0.811156
H  8.031419 -1.944031 0.906262
H  -6.334517 -2.627547 0.092028
H  -6.523165 -1.902887 -1.50463
H  10.171055 -0.70375 0.291345
H  10.20149 -2.384339 -0.31603
H  9.86116 -1.03378 -1.435794
H  -9.834928 -2.412488 -0.384986
