program: Gaussian 09
title: 000193111
version: EM64L-G09RevD.01
frameworkgroup: C1[X(C14H18O2)]
method: RPBEPBE
basis: SDD
operation: Freq
keyword: #pfreq=noraman
keyword: PBEPBE/SDD
title: #p freq=noraman PBEPBE/SDD
converged: NO YES NO NO
title: Mulliken charges:
elementType: O O C C C C C C C C C C C C C C H H H H H H H H H H H H H H H H H H
charge: -0.455006 -0.204006 -0.201241 0.224558 -0.450679 -0.467028 -0.489655 -0.506338 0.545499 0.167202 -0.474454 -0.399619 -0.788922 -0.221376 -0.249514 -0.247355 0.196375 0.223320 0.209926 0.245661 0.214633 0.228852 0.225656 0.220344 0.214790 0.340431 0.231383 0.233145 0.239244 0.268401 0.251506 0.223557 0.223368 0.227341
chargesum: 0.00000
title: Mulliken charges with hydrogens summed into heavy atoms:
elementType: O O C C C C C C C C C C C C C C
charge: -0.114575 -0.204006 -0.004866 0.224558 -0.017432 -0.006735 -0.035147 -0.071204 0.545499 0.167202 -0.243071 -0.166473 -0.029771 0.002180 -0.026145 -0.020013
polarizability: 1.91453115e+02 3.92951340e+00 1.44275026e+02 7.42610970e-02 3.24730486e+00 1.10975746e+02
1716.lowfreq: -14.4470 -11.1235 -0.0009 -0.0007 -0.0006 13.9571 32.9173 42.1263 45.4836
frequency: 32.4914 41.9879 45.4559 86.6063 131.0832 158.7863 167.0654 211.5847 254.1200 264.3509 288.9333 292.2733 303.1501 361.7188 369.8989 404.4023 445.6412 455.8522 471.9459 482.9534 534.2975 538.2382 600.7742 616.1424 639.0347 651.2481 706.2986 768.1472 776.4215 789.9375 851.1116 853.2695 897.4853 909.2796 928.9542 929.4332 958.7821 973.4159 974.9700 989.5280 992.7189 995.0536 1023.5051 1029.8575 1051.9950 1073.6301 1084.8790 1118.8243 1123.8517 1136.8727 1171.2222 1178.1733 1188.7523 1197.6288 1209.1990 1257.1526 1265.5852 1297.4321 1304.9605 1316.8128 1325.1559 1331.6116 1333.9041 1346.9349 1362.2161 1366.1947 1384.0866 1441.1839 1441.5864 1450.6859 1457.0433 1466.1403 1474.9940 1477.4997 1483.2594 1591.3600 1612.6275 1615.3131 2955.5651 2974.6743 2980.6176 2984.0876 2996.8607 3000.4440 3039.6552 3041.9637 3060.5242 3063.4969 3077.2903 3112.9787 3115.5634 3123.9819 3130.8038 3141.7440 3160.8806 3535.5000
redmass: 3.8547 4.6775 5.1953 4.0546 3.4151 1.5576 1.5718 5.0800 3.6046 4.4216 2.9382 2.5235 3.2967 2.1160 1.1698 2.8100 3.2913 3.1992 2.8829 2.3876 3.1775 4.0025 3.1707 6.3844 4.4751 3.0790 1.6614 1.9827 2.4792 1.5078 1.2475 2.8655 2.4039 1.6272 2.7038 1.6348 1.7821 1.4281 1.9477 4.8292 1.4438 2.0801 2.2842 2.0732 2.0296 1.7012 1.7883 1.7638 2.1185 1.6954 1.0628 1.8406 1.1133 1.2837 2.1808 1.3441 1.8848 1.3617 1.6751 1.3584 1.4141 1.4239 1.5998 1.4760 1.4767 1.3278 5.1748 1.2120 1.7105 1.0872 1.0616 1.0865 1.1650 1.1196 1.9232 5.9284 6.1503 8.5806 1.0814 1.0647 1.0590 1.0392 1.0626 1.0615 1.1001 1.0990 1.1006 1.1020 1.0916 1.0865 1.0866 1.1021 1.0907 1.0958 1.1014 1.0661
irintensity: 0.0233 0.0317 5.8128 0.8835 0.2655 0.3471 1.5534 3.1285 10.3190 4.1092 0.8642 1.5842 4.4247 8.6771 113.6706 0.0083 16.2106 4.9356 2.9304 1.6814 9.9222 12.8967 1.9280 0.0628 0.7081 4.1848 53.3666 46.1118 3.6226 1.9703 0.0264 3.8197 11.7432 4.6126 27.3150 4.9176 1.7906 1.3660 14.1351 6.1458 10.0090 34.9541 15.9318 1.6449 23.4254 6.0343 0.3442 19.2625 31.0257 8.3508 0.8528 32.4758 0.3569 18.4022 2.1110 1.5563 8.7716 0.3848 0.5146 16.9446 5.5211 8.3680 6.3715 1.6892 16.8819 48.4773 0.0482 31.6112 4.1591 17.6822 14.9278 8.7424 7.0541 2.6657 27.0616 1.8705 10.3014 92.8279 12.4988 33.1208 27.2092 2.2642 25.9573 21.6660 47.4069 10.9104 12.3149 52.1449 9.3146 9.5613 7.4107 9.4067 11.5732 45.3326 26.0780 6.2849
temp: 298.150 k
press: 1.00000 atm
elementType: 8 8 6 6 6 6 6 6 6 6 6 6 6 6 6 6 1 1 1 1 1 1 1 1 1 1 1 1 1 1 1 1 1 1
symmnumber: 1
zpe: 751455.8 jmol-1
zpe.correction: 0.286214 hartree
zpe.thermalcorrener: 0.301470 hartree
zpe.thermalcorrenthalpy: 0.302414 hartree
zpe.thermalcorrgfe: 0.243251 hartree
zpe.sumelectzpe: -693.533975 hartree
zpe.sumelectthermal: -693.518719 hartree
zpe.sumelectthermalent: -693.517775 hartree
zpe.sumelectthermalfe: -693.576939 hartree
dipole: 0.0741 -1.0299 -0.9569
dipole: 1.4078
quadrupole: -91.4485 -94.9263 -98.3381
quadrupole: 0.2228 -0.2766 -5.8331
quadrupole: 3.4558 -0.0220 -3.4338 0.2228 -0.2766 -5.8331
hfenergy: -693.8201895 hartree
pointgroup: C01 [X(C14H18O2)]
dipole: -0.0255104 -0.4963506 0.244445 debye
polarizability: 191.4331138|-3.6247157|143.298837|-1.955722|6.4939481|111.9719367 unknown
InChI: InChI=1S/C14H18O2/c1-11(15)14(16)9-7-13(8-10-14)12-5-3-2-4-6-12/h2-6,13,16H,7-10H2,1H3
charge 0 multiplicity 1
34 atoms
O  3.866685 -1.206112 -0.402003
O  2.697191 1.935656 -0.640898
C  -0.441446 -0.799847 -0.241365
C  2.562515 -0.49286 -0.253758
C  0.386534 -0.694987 1.072928
C  0.298066 -0.058075 -1.390304
C  1.823527 -1.230928 0.87937
C  1.751963 -0.559409 -1.564133
C  -1.873544 -0.30178 -0.057353
C  2.942449 0.97093 0.133589
C  -2.969419 -1.195534 -0.164326
C  -2.145617 1.062292 0.232685
C  3.672945 1.172537 1.452583
C  -4.298685 -0.746522 0.011388
C  -3.470927 1.515974 0.409479
C  -4.554704 0.613024 0.299829
H  -0.486974 -1.877015 -0.510901
H  -0.117093 -1.263815 1.876893
H  0.410149 0.363277 1.405368
H  0.313845 1.028777 -1.19002
H  -0.254419 -0.198968 -2.338362
H  2.400628 -1.16505 1.819044
H  1.792365 -2.301806 0.598672
H  1.750577 -1.616861 -1.896405
H  2.253161 0.046732 -2.343588
H  4.290766 -0.905595 -1.248227
H  -2.778041 -2.252629 -0.389252
H  -1.318409 1.778192 0.315763
H  2.941706 1.177841 2.284812
H  4.384506 0.350366 1.636651
H  4.193858 2.142877 1.446455
H  -5.130611 -1.454658 -0.077739
H  -3.660413 2.572802 0.630316
H  -5.58343 0.965375 0.43551
