program: Gaussian 09
title: 000193069
version: EM64L-G09RevD.01
frameworkgroup: C1[X(C10H4Br2N2O)]
method: RPBEPBE
basis: SDD
operation: Freq
keyword: #p
keyword: freq=noraman
keyword: PBEPBE/SDD
title: #p freq=noraman PBEPBE/SDD
converged: YES YES NO NO
title: Mulliken charges:
elementType: Br Br O N N C C C C C C C C C C H H H H
charge: 0.070186 0.087636 -0.365169 0.012863 -0.003616 0.531809 -0.377406 -0.261320 0.542656 -0.429125 -0.411510 -0.351746 0.287277 -0.241171 -0.250736 0.258434 0.275121 0.260544 0.365272
chargesum: 0.00000
title: Mulliken charges with hydrogens summed into heavy atoms:
elementType: Br Br O N N C C C C C C C C C C
charge: 0.070186 0.087636 0.000103 0.012863 -0.003616 0.531809 -0.118972 0.013801 0.542656 -0.429125 -0.411510 -0.091202 0.287277 -0.241171 -0.250736
polarizability: 2.92692699e+02 -1.17955997e+01 1.97884296e+02 -3.46440427e-03 4.04653523e-02 5.35803945e+01
1716.lowfreq: -3.8561 -3.0970 -0.0008 -0.0007 -0.0005 2.5094 28.8305 60.8317 69.4744
frequency: 28.8301 60.8314 69.4742 81.6224 113.3432 136.8339 151.8448 181.4769 194.6560 234.2908 258.2283 280.1687 286.4942 365.6344 375.0535 438.6765 456.2906 477.0051 504.6042 526.5749 594.6510 601.1870 607.1327 654.4210 705.1572 737.5080 776.2582 807.4938 886.7660 894.2436 916.5884 958.2146 1040.1430 1133.5252 1152.1942 1230.0529 1254.7789 1309.1299 1345.8015 1389.5807 1413.6292 1469.9872 1535.3829 1579.5183 1594.1230 2163.4160 2175.8192 3122.1009 3156.4254 3196.4824 3454.5503
redmass: 12.4546 8.6679 17.5200 11.0698 21.1410 17.1845 13.4947 8.4755 4.6651 19.4104 7.9963 6.6524 11.1721 8.1410 5.1960 10.1154 8.3545 1.7174 1.8859 5.2192 11.7366 10.0904 4.0295 5.9834 9.0663 4.8453 7.1808 7.0317 1.4325 1.4306 7.1665 1.5187 3.5658 1.7136 3.4478 1.9651 1.6527 2.9205 2.4711 2.1018 5.0969 3.6895 6.1278 6.2890 7.3190 12.6180 12.6356 1.0896 1.0927 1.0923 1.0648
irintensity: 1.3306 2.2968 1.7786 0.0026 1.4672 2.7180 1.0389 6.2657 2.5242 0.1304 7.0278 0.7457 1.4857 7.3949 0.2806 1.7359 0.3118 68.5062 70.0018 8.5002 9.9237 34.1905 5.6107 2.3393 62.2173 16.6938 12.8579 5.1032 4.8578 6.1316 8.1200 28.9819 2.7812 247.7784 24.4175 82.7181 140.4011 42.7619 33.8141 118.5874 23.5993 102.2016 57.3586 220.6417 0.9992 7.3355 55.4006 5.0203 0.4552 6.3653 131.6155
temp: 298.150 k
press: 1.00000 atm
elementType: 35 35 8 7 7 6 6 6 6 6 6 6 6 6 6 1 1 1 1
symmnumber: 1
zpe: 293552.8 jmol-1
zpe.correction: 0.111808 hartree
zpe.thermalcorrener: 0.126161 hartree
zpe.thermalcorrenthalpy: 0.127105 hartree
zpe.thermalcorrgfe: 0.067508 hartree
zpe.sumelectzpe: -594.027445 hartree
zpe.sumelectthermal: -594.013092 hartree
zpe.sumelectthermalent: -594.012148 hartree
zpe.sumelectthermalfe: -594.071745 hartree
dipole: -4.9243 0.3399 -0.0067
dipole: 4.9360
quadrupole: -140.5671 -103.2890 -105.9700
quadrupole: -1.8981 -0.0222 -0.0054
quadrupole: -23.9584 13.3197 10.6387 -1.8981 -0.0222 -0.0054
hfenergy: -594.1392531 hartree
pointgroup: C01 [X(C10H4Br2N2O1)]
dipole: 1.903212 0.3680639 -0.1166428 debye
dipolederiv: -0.1898158 0.1463871 -0.0827441 0.222973 -0.4053842 0.2275075 -0.1215627 0.224188 -0.0920736 -0.2174676 -0.2452455 0.115188 -0.3233095 -0.3413598 0.1750114 0.1549378 0.1783302 -0.0568103 -1.7432958 0.166821 -0.1392608 0.243627 -0.1974368 -0.0720721 -0.1793552 -0.0748587 -0.3268739 -0.4421031 0.0064408 -0.0125628 0.1071332 -0.1961365 -0.0090943 -0.0634388 -0.0132611 -0.2185622 -0.2093245 -0.0007335 0.0009476 -0.1982512 -0.2474911 0.0051842 0.1021149 0.0126994 -0.2251344 -0.8900358 0.0111626 -0.0403241 0.1675769 0.0134756 0.002742 -0.1212991 -0.0034083 0.0030827 0.244524 -0.0922003 0.0593979 0.0305383 -0.1070887 0.018659 -0.0031915 0.0140559 -0.0797398 0.1648426 -0.0169207 0.0162643 -0.1092365 -0.2129521 0.0928951 0.0640483 0.096305 -0.0682173 1.4145442 -0.1955977 0.1486158 -0.1425742 -0.2435896 0.2095128 0.122947 0.2075161 0.0801815 -0.279586 -0.2901102 0.1423195 -0.8673217 0.6832222 -0.4630421 0.4345558 -0.4404834 0.0759691 0.1230298 0.4611271 -0.2239208 1.0488726 0.6369168 -0.3621775 -0.5227287 -0.3852178 0.0199353 1.4468559 0.196739 -0.0426283 0.1627948 0.0134289 -0.0295275 -0.0253514 -0.0279336 -0.0427399 -0.6004773 -0.0896477 0.0178868 -0.5242156 0.1142494 -0.0125471 0.2402838 0.0043049 0.1363376 0.5011666 -0.0787252 0.0588086 -0.1820362 -0.0789798 0.0531605 0.1109747 0.0573436 0.0147183 -0.1154822 -0.0067677 -0.003342 0.3387301 0.1929261 -0.0572786 -0.1803971 -0.0705865 0.0843766 0.0809857 0.0626651 -0.0347362 0.038683 0.0421798 0.0581026 -0.0224765 0.059055 0.1226323 0.1418532 -0.0275879 0.01342 -0.0107572 0.0651975 0.0422764 0.0049079 0.0415854 0.1285357 0.0719986 -0.0049095 -0.0001156 0.0690939 0.0086268 0.0689146 -0.0372143 0.0660656 0.1033016 0.4977874 -0.0028968 0.0067863 -0.0723206 0.2601953 0.0517731 0.0422452 0.0543005 0.3410806 unknown
polarizability: 291.8322453|16.1121227|169.1511356|1.0048774|-58.1336498|83.1740082 unknown
InChI: InChI=1S/C10H4Br2N2O/c11-8-2-6(1-7(4-13)5-14)3-9(12)10(8)15/h1-3,15H
charge 0 multiplicity 1
19 atoms
Br 2.669924 -2.544593 1.220371
Br 3.326006 2.604818 -1.368874
O  4.12097 -0.02317 0.000446
N  -5.05579 0.620174 -0.684638
N  -2.501069 -2.591248 1.052014
C  -0.100719 0.297104 -0.329758
C  0.7764 1.317489 -0.813905
C  0.476932 -0.859131 0.279813
C  2.749812 0.052007 -0.092657
C  1.865931 -0.960165 0.386137
C  2.166362 1.198842 -0.698768
C  -1.528795 0.527641 -0.502321
C  -2.624432 -0.248875 -0.14796
C  -3.954001 0.22222 -0.440891
C  -2.548065 -1.526529 0.506911
H  0.356172 2.211868 -1.285052
H  -0.147973 -1.666604 0.664439
H  -1.783031 1.475465 -0.995985
H  4.400565 -0.871711 0.442676
