program: Gaussian 09
title: 000193068
version: EM64L-G09RevD.01
frameworkgroup: C1[X(C20H22N4)]
method: RPBEPBE
basis: SDD
operation: Freq
keyword: #pfreq=noraman
keyword: PBEPBE/SDD
title: #p freq=noraman PBEPBE/SDD
converged: YES YES NO NO
title: Mulliken charges:
elementType: N N N N C C C C C C C C C C C C C C C C C C C C H H H H H H H H H H H H H H H H H H H H H H
charge: -0.430010 -0.430560 -0.708088 -0.708183 0.429736 0.427234 -0.505491 -0.500240 -0.594574 -0.459592 -0.395773 -0.216566 0.464035 0.457416 -0.341860 -0.409918 -0.339271 -0.409156 -0.434632 -0.403442 -0.434960 -0.403740 0.499804 0.500148 0.218959 0.211789 0.217262 0.219244 0.272063 0.239484 0.267033 0.282249 0.281709 0.226767 0.230769 0.213313 0.231427 0.212628 0.208727 0.209812 0.208730 0.209480 0.296995 0.296208 0.295982 0.297050
chargesum: 0.00000
title: Mulliken charges with hydrogens summed into heavy atoms:
elementType: N N N N C C C C C C C C C C C C C C C C C C C C
charge: -0.147762 -0.148851 -0.114885 -0.115151 0.429736 0.427234 -0.074742 -0.063733 -0.322511 -0.220108 -0.128740 0.010201 0.464035 0.457416 -0.111091 -0.196604 -0.107845 -0.196527 -0.225905 -0.193629 -0.226231 -0.194260 0.499804 0.500148
polarizability: 3.83754590e+02 -4.37993319e+00 2.34070126e+02 1.93891138e+01 6.15315475e+00 1.73250894e+02
1716.lowfreq: -7.4044 -3.9294 -0.0010 -0.0004 0.0004 1.2636 11.2169 13.4378 26.4532
frequency: 10.9418 13.0650 26.2977 30.6050 52.1409 58.8073 77.6148 99.3331 135.2639 154.6819 159.5853 165.9774 214.5751 225.6355 232.0456 239.3372 256.3489 298.1909 301.8739 313.5782 331.9007 342.7305 351.5216 373.9574 395.9689 397.7488 409.6235 410.2173 429.8657 442.5240 488.1613 491.4903 505.3216 509.0745 509.9366 554.9863 605.2915 621.8016 639.9264 640.4806 706.3850 708.8721 709.3787 741.8562 782.7542 787.0541 791.7485 794.2597 805.7210 806.7419 813.0855 839.2721 850.1887 904.5458 904.9420 913.1951 919.2203 923.2745 923.6802 933.7417 988.3958 988.6653 990.6185 991.7410 992.4442 1012.6102 1013.9998 1014.8617 1085.1574 1102.2671 1106.8118 1134.8501 1135.2930 1165.0767 1177.3774 1187.7522 1189.1282 1206.4327 1211.6652 1254.3016 1267.4395 1270.9522 1297.9485 1303.1956 1307.3993 1322.3005 1323.9553 1339.8737 1344.9847 1379.4560 1379.8225 1392.0629 1427.1031 1427.8836 1440.3167 1473.8940 1477.7472 1477.9470 1491.5997 1494.0844 1525.0258 1527.8810 1585.1665 1585.7228 1599.3511 1618.5103 1632.8822 1633.9954 1656.6486 1657.1698 2892.1544 2896.1133 2960.3746 2961.4959 3104.2300 3105.6561 3114.3314 3114.9686 3119.2569 3125.7859 3129.8523 3131.1899 3135.5131 3151.7712 3152.1893 3155.8865 3548.2921 3549.0647 3575.6449 3576.0273 3716.5938 3717.0824
redmass: 4.9365 3.9400 3.6774 4.7878 4.6330 4.3980 4.5489 3.6114 5.1133 3.8037 3.4674 4.8041 4.0430 1.2147 1.2113 4.0915 3.1961 1.0469 1.0520 3.3636 2.5622 2.8526 4.4207 3.2690 1.7898 1.8086 2.5720 2.4646 2.7767 2.5903 5.3277 5.4693 2.6391 2.1963 2.2429 3.6821 5.5007 5.4575 6.6826 6.6310 2.4459 3.3361 3.3382 4.4496 2.0300 2.6891 1.3041 1.5037 1.8241 1.8258 2.4919 5.3806 3.8642 1.4124 1.4098 1.5607 1.3521 1.3548 1.3645 2.1538 2.2258 1.9151 2.6368 2.7214 2.0206 1.5186 1.4851 1.6022 2.0362 3.6866 2.4291 1.3132 1.2987 1.6491 1.0840 1.0911 1.0915 1.1228 1.1152 2.2397 1.7254 1.9273 1.5741 2.1816 1.7875 1.5961 1.7679 1.9420 2.0285 3.5765 4.7683 3.5871 2.8029 2.8649 2.8430 1.9082 1.7941 2.0761 1.1103 1.1790 3.0703 3.1668 5.7078 5.6669 6.1893 6.2561 1.2038 1.2036 5.3107 5.3300 1.0681 1.0677 1.0903 1.0907 1.0863 1.0862 1.0884 1.0883 1.0870 1.0914 1.0962 1.0962 1.0912 1.0941 1.0940 1.0990 1.0765 1.0764 1.0447 1.0446 1.1041 1.1041
irintensity: 0.0588 0.0492 0.1602 0.2503 0.7233 0.1739 3.7653 2.3391 1.3806 3.3459 0.9062 0.5986 1.4592 317.5336 319.8794 0.6906 0.3964 2.2716 2.1598 15.9983 48.5079 20.3836 4.9691 8.3331 159.7710 92.1376 24.7121 12.5970 7.3318 56.9314 1.9552 12.7336 24.2495 17.9872 21.2235 6.0623 0.6115 0.2769 0.2100 0.4027 18.1324 0.9687 0.7335 3.7122 22.3660 32.9576 0.1701 10.3550 101.0627 96.0446 25.0287 1.6522 1.6507 1.4191 1.0782 5.5392 3.2814 0.6057 0.4082 6.4229 6.5336 0.6049 1.0747 0.2599 8.2603 2.9443 2.9085 4.0363 22.4895 5.0554 6.2924 20.7597 27.0216 5.5108 5.6394 3.8721 5.0125 18.3226 18.5964 11.8030 181.8262 87.2495 30.3465 80.2476 11.5044 19.7581 7.0845 1.9540 5.3550 64.5555 35.9620 15.3011 53.3376 22.4643 18.6273 111.9566 35.6159 6.6662 38.7858 60.2514 829.9178 249.8032 0.5185 0.4635 5.8899 22.4481 171.6581 130.9337 15.4715 11.7424 78.3919 81.1933 24.8901 27.4079 24.6366 23.5939 41.6030 40.5947 5.5194 8.0694 33.6288 33.0446 19.2924 14.9341 16.1554 22.4369 22.8044 20.5663 73.2064 61.9835 17.0535 17.0672
temp: 298.150 k
press: 1.00000 atm
elementType: 7 7 7 7 6 6 6 6 6 6 6 6 6 6 6 6 6 6 6 6 6 6 6 6 1 1 1 1 1 1 1 1 1 1 1 1 1 1 1 1 1 1 1 1 1 1
symmnumber: 1
zpe: 990649.1 jmol-1
zpe.correction: 0.377318 hartree
zpe.thermalcorrener: 0.400561 hartree
zpe.thermalcorrenthalpy: 0.401505 hartree
zpe.thermalcorrgfe: 0.321308 hartree
zpe.sumelectzpe: -992.625200 hartree
zpe.sumelectthermal: -992.601958 hartree
zpe.sumelectthermalent: -992.601013 hartree
zpe.sumelectthermalfe: -992.681211 hartree
dipole: -0.2953 -0.6958 0.5050
dipole: 0.9090
quadrupole: -104.2501 -131.2922 -135.8034
quadrupole: -2.8174 4.9371 1.0411
quadrupole: 19.5318 -7.5103 -12.0215 -2.8174 4.9371 1.0411
hfenergy: -993.0025188 hartree
pointgroup: C01 [X(C20H22N4)]
dipole: 0.1211033 0.2968115 0.1585758 debye
polarizability: 382.3402007|-7.0931262|231.537753|-25.3614494|-13.3874272|177.1976562 unknown
InChI: InChI=1S/C20H22N4/c21-17-4-8-19(9-5-17)23-13-15-2-1-3-16(12-15)14-24-20-10-6-18(22)7-11-20/h1-12,23-24H,13-14,21-22H2
charge 0 multiplicity 1
46 atoms
N  3.094193 -0.293434 0.308269
N  -3.171477 -0.398566 0.489507
N  7.935848 2.52149 -0.739331
N  -8.145016 2.2798 -0.254978
C  1.354937 -2.029361 0.053229
C  -1.049705 -1.50012 -0.12808
C  2.809459 -1.642283 -0.187742
C  -2.164581 -0.556286 -0.563805
C  0.306337 -1.147173 -0.315505
C  1.026883 -3.279845 0.628257
C  -1.361132 -2.761631 0.445061
C  -0.326683 -3.644024 0.821106
C  4.313447 0.370238 0.051497
C  -4.385618 0.29086 0.282493
C  5.31042 -0.164086 -0.811593
C  4.567626 1.638393 0.648718
C  -4.785018 0.772349 -0.995415
C  -5.274864 0.502702 1.375168
C  6.500038 0.548545 -1.076933
C  5.757633 2.342841 0.39354
C  -6.026262 1.421363 -1.172124
C  -6.506408 1.159295 1.201333
C  6.749816 1.813859 -0.481594
C  -6.911975 1.629234 -0.081155
H  3.01463 -1.659371 -1.279164
H  3.477342 -2.411361 0.267108
H  -1.724655 0.419224 -0.878189
H  -2.666245 -0.974253 -1.462308
H  0.564045 -0.174413 -0.752595
H  1.828116 -3.966263 0.928139
H  -2.411657 -3.037407 0.590423
H  2.577407 -0.004945 1.139903
H  -2.825513 -0.446415 1.448685
H  -0.571551 -4.6156 1.264957
H  5.172933 -1.144494 -1.279001
H  3.815774 2.079469 1.316121
H  -4.128225 0.653357 -1.863125
H  -4.997262 0.139228 2.373288
H  7.247616 0.109045 -1.749616
H  5.919644 3.316873 0.872573
H  -6.304693 1.778716 -2.171809
H  -7.165273 1.30552 2.066828
H  8.640975 2.144022 -1.363756
H  8.105729 3.424865 -0.309649
H  -8.769341 2.428329 0.53095
H  -8.432793 2.611815 -1.169589
