program: Gaussian 09
title: 000193067
version: EM64L-G09RevD.01
frameworkgroup: C1[X(C17H28N2O)]
method: RPBEPBE
basis: SDD
operation: Freq
keyword: #p
keyword: freq=noraman
keyword: PBEPBE/SDD
title: #p freq=noraman PBEPBE/SDD
converged: YES YES NO NO
title: Mulliken charges:
elementType: O N N C C C C C C C C C C C C C C C C C H H H H H H H H H H H H H H H H H H H H H H H H H H H H
charge: -0.347207 -0.113150 -0.123898 -0.365817 -0.358249 -0.557827 -0.299657 -0.580713 -0.539586 -0.549091 -0.571712 0.407077 -0.699790 -0.463615 0.303635 0.191106 -0.378775 -0.362613 -0.215477 -0.189272 0.279636 0.309038 0.319083 0.281895 0.281366 0.313160 0.269923 0.285181 0.277110 0.258465 0.288961 0.274021 0.284315 0.278988 0.260527 0.289365 0.276612 0.267943 0.295113 0.284707 0.295135 0.232448 0.254077 0.295972 0.278149 0.248493 0.268901 0.266047
chargesum: 2.00000
title: Mulliken charges with hydrogens summed into heavy atoms:
elementType: O N N C C C C C C C C C C C C C C C C C
charge: -0.347207 -0.113150 -0.123898 0.222857 0.242730 0.036698 0.255447 0.243823 0.297737 0.277413 0.276051 0.407077 0.081870 -0.167643 0.303635 0.191106 -0.100627 -0.114120 0.053424 0.076775
polarizability: 2.57311906e+02 2.09444053e+01 2.08366151e+02 2.10060112e+01 3.42000449e+00 1.35229748e+02
1716.lowfreq: -9.5660 -8.2791 -2.7491 -0.0006 0.0005 0.0006 22.4131 28.7065 44.4512
frequency: 22.1795 28.6015 44.2494 51.3456 73.2351 84.6952 106.1105 130.0616 151.3286 173.8949 195.2218 229.5073 236.0010 239.7580 253.3548 261.1327 264.1654 281.9309 287.0605 312.7764 335.5205 339.9056 363.3291 392.0611 421.7425 425.7497 444.9523 449.8709 461.1617 500.9231 505.9409 533.6955 557.3852 594.5478 602.7985 682.3506 703.5159 730.9241 742.5854 756.8325 765.2612 789.8738 800.9105 808.4557 844.9570 858.7192 863.3986 884.2440 889.3313 897.4959 913.6810 931.6592 959.8585 960.7949 975.2646 1006.5786 1007.5385 1011.8222 1044.1907 1051.4904 1059.1067 1092.6838 1097.9004 1105.4462 1112.1111 1138.4749 1151.9173 1154.1738 1157.5763 1166.1021 1180.3052 1213.5301 1216.0689 1220.8296 1247.8923 1256.5598 1274.2361 1292.0698 1315.0724 1319.0597 1331.7394 1338.2162 1363.0072 1367.5552 1400.8515 1412.8551 1416.1422 1423.6466 1426.8952 1430.6962 1434.8916 1445.6096 1451.2347 1453.6157 1458.4178 1462.8607 1464.8083 1467.1752 1470.3984 1476.6221 1479.5277 1482.5191 1486.6574 1489.9651 1490.6394 1492.7933 1501.0338 1577.3857 1596.6953 1619.3908 3004.7280 3026.6540 3026.7338 3028.0172 3028.2740 3029.8828 3033.4236 3037.8312 3045.7600 3089.0630 3092.9060 3103.6934 3111.9867 3116.7661 3123.8519 3140.4637 3145.0888 3146.1323 3148.3403 3149.6230 3150.5233 3152.9129 3153.7561 3155.9104 3163.6242 3173.3167 3187.5952 3211.4731
redmass: 3.9475 2.7787 3.8102 3.8200 2.3442 2.9679 2.2932 2.0713 4.6778 2.9061 1.2002 2.7995 1.2591 1.3695 3.0110 1.2364 1.1969 1.8282 3.6125 2.8319 2.2937 2.1302 2.4614 2.5245 2.9980 2.3470 3.3175 2.2368 2.9586 2.9109 3.8146 4.4160 3.4609 4.0663 6.7155 4.1590 4.9697 4.1809 4.3468 2.8368 1.2566 1.4131 1.1827 4.3985 3.5722 1.4029 2.8864 3.2621 1.4777 6.4398 2.7839 2.7287 1.8850 1.3823 2.2678 1.3497 2.1287 2.2614 1.2006 1.8637 1.7257 2.0960 2.5683 1.3103 1.4977 1.5678 1.6850 1.6004 1.5049 1.6471 1.2194 1.7834 1.8246 1.9358 1.9075 1.9943 1.4907 1.2436 1.3275 1.7549 1.2581 1.2912 1.2875 1.2448 1.2423 5.3218 1.2168 1.1613 1.2306 2.0847 1.1557 1.0894 1.1002 1.0628 1.1011 1.0612 1.0556 1.0903 2.4996 1.0533 1.0786 1.0633 1.0592 1.0557 1.0561 1.0594 1.0636 6.8780 7.0362 7.7898 1.0382 1.0568 1.0344 1.0338 1.0364 1.0377 1.0524 1.0591 1.0573 1.1028 1.0999 1.1066 1.1048 1.1039 1.1075 1.1044 1.1058 1.1055 1.1062 1.1052 1.1062 1.1061 1.1056 1.0887 1.0908 1.0965 1.1005 1.0995
irintensity: 2.1607 0.5980 2.7022 1.7002 1.0302 1.1333 1.4331 0.0537 6.1457 5.2655 0.0823 0.2532 0.4217 0.1432 1.5828 0.3649 0.0238 0.6687 0.2708 0.4860 0.9598 0.2945 0.1414 2.4237 5.6158 0.4820 5.0774 0.9226 2.3047 0.3972 12.2835 2.2336 0.1651 8.5207 5.0653 42.1680 10.8646 77.2996 4.5001 105.1365 93.1560 6.6887 9.5712 21.1221 8.3523 4.4989 29.0803 34.8111 26.1981 19.9796 16.1377 18.3414 2.8901 3.2813 6.6775 0.1047 3.0082 26.8482 0.1910 0.3477 0.4547 4.1355 6.7232 2.1712 0.5460 25.0230 5.8658 50.3258 4.1719 2.0721 4.8369 0.9152 2.0527 1.8566 3.3723 3.6675 11.0383 7.1158 9.0186 14.8033 11.4297 21.6049 6.7032 11.2432 3.0941 4.9604 44.7238 21.8403 5.4025 14.8484 28.6903 4.3744 12.9937 7.9337 6.0360 5.0125 6.4827 20.7078 1.1092 19.8551 2.2620 78.5733 28.2223 35.1959 36.3370 30.5886 63.3913 86.9160 26.4584 51.0766 4.9636 2.7533 1.5284 0.5694 0.2448 1.8544 0.7142 19.5301 3.1396 2.3294 3.8015 1.4175 2.8130 13.9076 0.1939 3.5076 0.8645 0.4893 0.5381 2.6997 1.2122 5.9605 1.5212 0.6386 0.7514 4.1453 1.7695 3.9837
temp: 298.150 k
press: 1.00000 atm
elementType: 8 7 7 6 6 6 6 6 6 6 6 6 6 6 6 6 6 6 6 6 1 1 1 1 1 1 1 1 1 1 1 1 1 1 1 1 1 1 1 1 1 1 1 1 1 1 1 1
symmnumber: 1
zpe: 1116721.3 jmol-1
zpe.correction: 0.425337 hartree
zpe.thermalcorrener: 0.446687 hartree
zpe.thermalcorrenthalpy: 0.447631 hartree
zpe.thermalcorrgfe: 0.374970 hartree
zpe.sumelectzpe: -847.174395 hartree
zpe.sumelectthermal: -847.153045 hartree
zpe.sumelectthermalent: -847.152101 hartree
zpe.sumelectthermalfe: -847.224762 hartree
dipole: -11.9566 1.6553 0.4592
dipole: 12.0794
quadrupole: -34.9731 -48.1972 -105.7650
quadrupole: -9.1717 4.4091 2.6961
quadrupole: 28.0054 14.7812 -42.7866 -9.1717 4.4091 2.6961
hfenergy: -847.599732 hartree
pointgroup: C01 [X(C17H28N2O1)]
dipole: -4.7122918 -0.5029756 -0.3558465 debye
polarizability: 257.3305271|-22.7689858|209.8188375|-16.0077662|2.5072749|133.7584394 unknown
InChI: InChI=1S/C17H28N2O/c1-6-19(5,12-11-18(2,3)4)14-16-13-15-9-7-8-10-17(15)20-16/h7-10,13H,6,11-12,14H2,1-5H3
charge 2 multiplicity 1
48 atoms
O  0.799902 -0.325878 0.709556
N  -1.79116 1.708528 0.234873
N  -2.585133 -2.150498 -0.209803
C  -2.007579 0.359444 -0.470228
C  -2.326352 -0.799632 0.500598
C  -0.59216 1.632794 1.295838
C  -1.389855 2.774338 -0.839645
C  -3.041881 2.170081 0.980185
C  -2.72946 -3.21606 0.891233
C  -3.878768 -2.120187 -1.030382
C  -1.406911 -2.539359 -1.113031
C  0.68542 1.107919 0.772843
C  -2.427843 3.042981 -1.93361
C  1.890242 1.706558 0.443933
C  2.840833 0.653039 0.152018
C  2.149645 -0.582009 0.327576
C  4.210579 0.631559 -0.22181
C  2.738338 -1.841667 0.160092
C  4.824827 -0.622147 -0.402718
C  4.103112 -1.837487 -0.212097
H  -2.824965 0.523273 -1.19045
H  -1.073875 0.158089 -1.018325
H  -1.46977 -0.97924 1.169762
H  -3.232017 -0.599457 1.097421
H  -0.978437 1.025034 2.1320
H  -0.4734 2.669728 1.64796
H  -1.189918 3.694165 -0.262621
H  -0.434668 2.420804 -1.263771
H  -3.918853 2.105098 0.319839
H  -3.196115 1.551266 1.877088
H  -2.900699 3.21562 1.293605
H  -3.534219 -2.919177 1.581009
H  -2.981729 -4.178524 0.421709
H  -1.776549 -3.304425 1.434581
H  -3.79535 -1.378577 -1.837856
H  -4.036328 -3.114962 -1.473953
H  -4.723611 -1.875542 -0.368391
H  -1.401107 -1.906029 -2.012269
H  -0.468717 -2.413165 -0.552133
H  -1.532047 -3.590068 -1.414928
H  -2.02855 3.854779 -2.56769
H  -2.597548 2.185541 -2.606488
H  -3.39466 3.401677 -1.543454
H  2.093715 2.777706 0.441406
H  4.775293 1.55837 -0.358989
H  2.201322 -2.778211 0.33546
H  5.880104 -0.672231 -0.686112
H  4.621902 -2.791861 -0.345433
