program: Gaussian 09
title: 000191138
version: EM64L-G09RevD.01
frameworkgroup: C1[X(C12H16INO4)]
method: RPBEPBE
basis: SDD
operation: Freq
keyword: #p
keyword: freq=noraman
keyword: PBEPBE/SDD
title: #p freq=noraman PBEPBE/SDD
converged: YES YES NO NO
title: Mulliken charges:
elementType: I O O O O N C C C C C C C C C C C C H H H H H H H H H H H H H H H H
charge: 0.026987 -0.288790 -0.340541 -0.452585 -0.270625 -0.340290 -0.561202 0.575037 -0.360253 -0.566911 -0.588145 0.260319 0.284121 -0.008846 0.300842 -0.827526 -0.514852 -0.519371 0.225574 0.210712 0.225382 0.259251 0.248406 0.273804 0.329666 0.388001 0.313117 0.311208 0.229028 0.213612 0.264651 0.227918 0.227755 0.244546
chargesum: 0.00000
title: Mulliken charges with hydrogens summed into heavy atoms:
elementType: I O O O O N C C C C C C C C C C C C
charge: 0.026987 -0.288790 -0.340541 -0.064583 -0.270625 -0.010624 -0.124915 0.575037 0.124379 -0.318505 -0.314340 0.260319 0.284121 -0.008846 0.300842 -0.203202 0.192438 0.180849
polarizability: 1.87912991e+02 1.40925725e+01 2.22132301e+02 2.75657883e+01 2.12373977e+00 1.19123240e+02
1716.lowfreq: -10.6289 -7.0904 0.0007 0.0008 0.0008 3.6721 7.6847 10.2277 18.4364
frequency: 7.4368 8.9463 18.2004 40.0705 45.3473 66.9927 71.3995 86.2254 114.0442 135.1540 163.6987 178.1080 193.1974 205.2297 227.5822 259.8546 262.8890 307.4142 308.6402 324.3186 355.4987 390.8289 419.6222 456.2118 492.3995 499.4108 533.1364 549.9959 573.9281 577.3412 610.3542 631.9362 644.1943 671.0336 718.6360 758.3105 813.9216 832.4101 835.7658 861.7257 874.3799 890.3474 938.0530 980.3313 1026.6522 1035.1040 1072.1960 1095.7350 1112.7893 1115.9131 1131.2600 1140.0250 1156.4002 1161.3057 1187.1137 1193.3359 1202.5190 1219.2061 1225.3422 1261.8586 1276.4570 1301.5674 1325.1121 1352.2338 1408.6048 1412.7253 1421.0278 1443.0360 1448.5772 1453.5467 1463.0139 1463.1918 1471.9116 1475.2682 1476.5819 1493.0203 1503.9579 1596.4761 1605.0508 1615.0757 2968.2965 2977.6193 2982.7697 2995.1120 3058.2037 3059.1196 3067.4410 3069.4113 3093.7663 3128.4192 3134.1090 3147.1711 3148.7947 3153.1125 3472.3559 3487.9342
redmass: 6.4650 5.2058 10.0800 2.2351 3.8995 2.9955 5.9840 3.7313 2.1122 3.2635 2.8490 2.1022 2.3670 2.5977 3.9998 2.6439 3.6178 4.3794 4.4207 4.8849 3.8420 3.9276 4.4681 3.8943 1.1195 4.9041 5.1704 2.9286 4.5395 4.7334 5.0005 4.2597 3.1096 1.1565 3.7764 4.8696 1.6623 1.9553 1.7608 5.1653 1.8589 2.9380 3.7398 3.6629 3.1283 2.0204 3.8906 4.2895 1.2408 1.2550 2.6223 1.1533 1.4389 1.4482 1.3009 1.6985 1.2021 1.9703 1.3067 1.7708 1.4936 2.3668 1.8275 1.3898 1.0985 2.2428 2.7674 1.3781 1.4951 1.0752 1.0509 1.1216 1.1783 1.0563 1.0921 2.5961 2.1793 8.4054 7.0804 6.7451 1.0323 1.0663 1.0345 1.0616 1.0991 1.1045 1.0573 1.0982 1.0972 1.1003 1.1056 1.0909 1.1073 1.0921 1.0780 1.0642
irintensity: 0.3988 0.4468 0.1846 3.3873 13.0132 4.7008 3.6903 1.3099 0.3606 7.2142 3.5940 1.7826 0.7125 2.2305 4.3065 0.1402 0.2170 7.1082 4.4876 14.6118 1.4949 7.6964 0.7899 1.9480 130.6114 2.7659 15.2877 4.4297 15.9527 6.6378 72.4778 2.5539 11.6250 88.1706 1.3132 16.6003 12.3652 24.0783 14.9810 37.0159 18.4378 11.0605 0.8456 18.7024 16.0321 25.0174 170.2634 7.9963 4.5383 0.1593 24.0696 0.9182 12.6311 27.6236 63.9592 133.5644 26.2443 61.1345 41.8392 45.3139 191.6177 41.2360 36.7583 28.2289 35.5555 58.2950 4.2088 1.9110 31.7433 18.6103 10.4238 22.4563 89.2253 24.3676 23.5350 138.7799 226.4071 254.6349 73.1988 41.8027 54.8659 33.5760 81.3369 34.7624 18.5382 42.4878 1.8255 13.5256 34.4863 21.6988 13.8207 6.6934 0.0058 2.2233 58.3331 89.4945
temp: 298.150 k
press: 1.00000 atm
elementType: 53 8 8 8 8 7 6 6 6 6 6 6 6 6 6 6 6 6 1 1 1 1 1 1 1 1 1 1 1 1 1 1 1 1
symmnumber: 1
zpe: 695158.0 jmol-1
zpe.correction: 0.264772 hartree
zpe.thermalcorrener: 0.284922 hartree
zpe.thermalcorrenthalpy: 0.285866 hartree
zpe.thermalcorrgfe: 0.209424 hartree
zpe.sumelectzpe: -832.638525 hartree
zpe.sumelectthermal: -832.618375 hartree
zpe.sumelectthermalent: -832.617431 hartree
zpe.sumelectthermalfe: -832.693874 hartree
dipole: -5.3272 1.4154 -1.0242
dipole: 5.6064
quadrupole: -113.0969 -119.6095 -117.7196
quadrupole: -16.3622 4.7987 -6.4864
quadrupole: 3.7117 -2.8008 -0.9109 -16.3622 4.7987 -6.4864
hfenergy: -832.9032971 hartree
pointgroup: C01 [X(C12H16I1N1O4)]
dipole: 2.0917083 0.6999818 0.0067792 debye
polarizability: 196.1040617|-13.3006568|218.2466506|19.1133379|-14.3940111|114.8178194 unknown
InChI: InChI=1S/C12H16INO4/c1-17-9-5-8(3-4-14-11(15)7-13)6-10(18-2)12(9)16/h5-6,14,16H,3-4,7H2,1-2H3
charge 0 multiplicity 1
34 atoms
I  -3.52237 -1.76606 1.877488
O  0.685084 -2.955561 -0.264095
O  3.533578 0.672182 1.23999
O  3.104719 -1.920443 1.117826
O  -4.566222 2.27456 0.412007
N  -2.51627 1.162008 0.539945
C  -0.789746 1.658573 -1.204587
C  0.256999 0.705648 -0.641177
C  -1.73858 2.22611 -0.114202
C  1.41479 1.222034 0.003214
C  0.080104 -0.691978 -0.721833
C  1.019976 -1.599811 -0.16427
C  2.344571 0.326107 0.557651
C  2.160764 -1.084756 0.497953
C  -3.864887 1.263479 0.744144
C  -4.621428 0.121652 1.428063
C  1.763556 -3.950996 -0.444277
C  3.827706 2.093608 1.422695
H  -1.399624 1.148941 -1.972484
H  -0.298087 2.520783 -1.695011
H  -1.144725 2.774803 0.644241
H  -2.464832 2.933618 -0.550994
H  1.574181 2.303805 0.055157
H  -0.787693 -1.123425 -1.231304
H  -2.023027 0.311067 0.83223
H  3.8002 -1.332982 1.520879
H  -5.46461 -0.181321 0.79026
H  -5.003276 0.467373 2.400927
H  1.235113 -4.905217 -0.59026
H  2.363584 -3.709999 -1.342363
H  2.420237 -3.993442 0.437953
H  3.024728 2.591804 1.998698
H  3.957857 2.598309 0.446548
H  4.770229 2.128728 1.988288
