program: Gaussian 09
title: 000191125
version: EM64L-G09RevD.01
frameworkgroup: C1[X(C20H24N2O3)]
method: RPBEPBE
basis: SDD
operation: Freq
keyword: #p
keyword: freq=noraman
keyword: PBEPBE/SDD
title: #p freq=noraman PBEPBE/SDD
converged: YES YES NO NO
title: Mulliken charges:
elementType: O O O N N C C C C C C C C C C C C C C C C C C C C H H H H H H H H H H H H H H H H H H H H H H H H
charge: -0.300699 -0.301646 -0.304116 -0.124321 -0.695267 -0.161532 -0.591793 -0.388270 0.338897 -0.510314 -0.555286 0.309736 0.368030 0.301696 -0.536514 -0.566688 -0.621472 -0.541967 0.165137 0.197285 0.338650 0.162047 -0.530700 -0.530093 -0.530037 0.203568 0.208925 0.244902 0.193348 0.212991 0.227925 0.185882 0.210265 0.234143 0.254347 0.257337 0.226769 0.236896 0.331868 0.298956 0.220522 0.252961 0.226849 0.221392 0.253779 0.226556 0.221064 0.220402 0.237586
chargesum: 0.00000
title: Mulliken charges with hydrogens summed into heavy atoms:
elementType: O O O N N C C C C C C C C C C C C C C C C C C C C
charge: -0.300699 -0.301646 -0.304116 -0.124321 -0.064442 0.042037 -0.137966 0.018069 0.338897 -0.096507 -0.110878 0.309736 0.368030 0.301696 -0.282168 -0.309351 -0.394703 -0.305071 0.165137 0.197285 0.338650 0.162047 0.169633 0.171635 0.149016
polarizability: 3.55852010e+02 -4.76434992e+00 2.46202279e+02 -9.86891944e+00 2.40532673e+00 1.47161616e+02
1716.lowfreq: -7.9609 -2.8936 -2.1548 0.0005 0.0008 0.0009 26.0792 33.6817 51.8415
frequency: 26.0617 33.6209 51.8242 69.9063 84.3878 90.5936 103.6641 123.7944 145.3429 148.4458 161.4499 170.2296 181.6362 191.9594 200.5790 211.8954 232.9668 248.6571 261.8152 272.5256 279.6530 296.8557 317.5548 320.1129 339.9345 361.4499 386.3074 403.3301 422.2161 434.5265 436.5134 468.2147 484.2284 493.1042 500.2157 509.7066 527.8665 551.5240 595.5475 629.4202 631.8290 683.7992 699.1747 716.9315 725.3744 729.0634 740.6280 743.7651 753.2981 819.4661 838.1514 847.4407 862.5256 881.3491 893.4604 905.5232 925.5177 956.1736 978.3087 982.3439 984.8654 1009.8366 1031.5272 1049.4857 1072.6818 1080.6398 1104.6057 1113.4119 1115.1069 1115.7699 1129.8902 1146.5859 1151.7642 1154.2445 1162.0074 1172.4282 1180.7496 1192.5508 1193.0041 1208.1313 1218.3730 1222.4937 1243.9308 1255.4406 1265.4543 1274.1427 1292.0643 1309.7653 1319.8553 1322.8509 1334.5286 1351.7589 1370.0246 1384.1771 1395.5429 1419.4322 1423.8228 1433.1743 1443.1859 1443.6505 1445.0210 1446.1868 1457.3122 1459.2396 1462.8858 1463.4580 1476.0888 1478.1883 1481.5222 1487.9094 1489.9250 1530.4910 1570.2664 1601.8526 1608.2499 1618.6149 1639.6234 2782.5637 2796.5818 2844.2041 2954.8101 2968.2682 2970.1520 2979.7303 2980.4180 2988.3213 3025.8954 3036.7320 3037.8097 3039.6228 3064.5119 3066.3409 3109.3591 3117.4804 3117.5431 3117.9267 3131.0667 3138.2829 3144.6221 3569.2328 3717.4177
redmass: 4.2137 4.1795 4.4157 3.2541 3.7246 3.4393 2.7393 3.7058 3.2720 2.6862 2.0583 1.1458 1.7613 2.2089 2.9424 2.7214 1.5750 3.8506 4.1358 2.6465 3.9327 2.8919 1.2185 3.2084 4.5445 4.1442 3.9236 3.9258 4.6087 2.4804 4.4613 1.1310 4.7991 3.1611 3.5365 4.4388 3.7665 4.3808 4.3483 5.0364 4.6158 5.6937 4.4963 5.0962 3.8615 3.3321 4.4183 3.1952 3.9032 3.4808 1.5055 1.8611 2.2507 1.7246 1.8127 1.6890 3.9317 5.6483 2.2301 2.1339 5.6626 2.2967 2.3430 1.6421 2.5195 4.0825 3.6793 1.2448 1.2450 1.2620 2.7541 1.7251 1.6107 1.4467 1.4869 1.6206 2.0281 1.3589 2.0418 1.4557 1.9089 1.2654 1.4892 1.4691 1.6177 3.6543 1.3092 1.9943 1.6599 1.6103 2.0422 2.0122 5.2942 1.7910 2.4189 4.5273 1.1771 1.9593 1.2208 1.2481 1.2520 1.5890 1.0554 1.0621 1.0948 1.0577 1.0649 1.0549 1.1282 1.1016 2.7479 3.6511 8.6246 5.4153 1.4404 7.2302 4.1266 1.0719 1.0781 1.0710 1.0329 1.0310 1.0312 1.0598 1.0605 1.0848 1.0874 1.1007 1.1007 1.1036 1.1033 1.1036 1.0907 1.0992 1.1025 1.1027 1.0904 1.0912 1.0909 1.0440 1.1046
irintensity: 0.6681 0.0349 0.1503 2.5740 0.9901 9.8188 6.8479 1.3065 0.6456 2.1266 2.1719 0.3563 4.6367 1.6436 2.3526 7.4172 2.2044 4.8960 7.1392 2.6456 4.5801 1.2176 180.6785 18.1872 1.4085 5.7174 38.1753 4.3359 6.2097 9.5925 7.5431 64.0042 8.1729 8.6859 1.1771 0.4817 0.6222 1.2352 9.0769 2.5199 7.3275 5.4774 2.4098 3.2930 7.9555 2.3329 7.2268 15.1390 7.4726 18.8118 22.3222 8.0527 19.8056 1.9643 1.0326 20.9580 36.7275 102.0836 1.6783 26.6486 26.1609 16.9406 1.7336 6.6213 1.8831 37.5872 93.7281 13.1016 7.2597 0.2601 17.4677 33.5653 15.2680 2.4712 14.7658 46.6844 13.4096 2.8335 97.9327 17.7648 28.2165 2.1142 4.0621 22.3305 30.5170 120.3839 3.7781 27.9171 20.9063 23.0687 32.5868 142.5143 3.5584 7.6617 18.2434 1.8343 0.1070 3.0282 3.1673 1.1422 14.7455 9.5360 13.6967 7.6257 8.7170 11.3956 55.7204 5.1848 7.3885 1.3389 199.6804 212.6943 0.2619 4.9989 59.3002 3.6412 211.5135 69.8808 70.1337 137.3308 73.1429 96.0023 65.6050 30.1350 29.6967 27.4239 60.8658 19.2965 31.9731 54.1288 32.3840 23.5218 22.2628 35.9255 24.4738 28.2208 11.7490 10.7642 2.6991 90.8391 31.5401
temp: 298.150 k
press: 1.00000 atm
elementType: 8 8 8 7 7 6 6 6 6 6 6 6 6 6 6 6 6 6 6 6 6 6 6 6 6 1 1 1 1 1 1 1 1 1 1 1 1 1 1 1 1 1 1 1 1 1 1 1 1
symmnumber: 1
zpe: 1056257.4 jmol-1
zpe.correction: 0.402307 hartree
zpe.thermalcorrener: 0.426229 hartree
zpe.thermalcorrenthalpy: 0.427173 hartree
zpe.thermalcorrgfe: 0.349530 hartree
zpe.sumelectzpe: -1109.811584 hartree
zpe.sumelectthermal: -1109.787663 hartree
zpe.sumelectthermalent: -1109.786719 hartree
zpe.sumelectthermalfe: -1109.864362 hartree
dipole: -1.6023 0.2194 0.7727
dipole: 1.7924
quadrupole: -120.8238 -132.5981 -146.8412
quadrupole: -7.2744 -3.7129 2.7346
quadrupole: 12.5972 0.8229 -13.4201 -7.2744 -3.7129 2.7346
hfenergy: -1110.2138915 hartree
pointgroup: C01 [X(C20H24N2O3)]
dipole: 0.6264292 -0.0494353 0.3200069 debye
polarizability: 355.554094|-3.5445575|244.1291004|12.8792992|-14.4891955|149.5327113 unknown
InChI: InChI=1S/C20H24N2O3/c1-23-18-9-14-11-22-5-4-12-8-19(24-2)20(25-3)10-15(12)17(22)7-13(14)6-16(18)21/h6,8-10,17H,4-5,7,11,21H2,1-3H3
charge 0 multiplicity 1
49 atoms
O  -4.346833 2.304335 0.302368
O  -5.845897 -0.121072 -0.38802
O  6.353121 0.530479 0.123621
N  0.478734 -1.629713 0.241024
N  5.205643 2.7094 -0.910163
C  -0.117295 -0.288533 0.483899
C  0.620651 0.718406 -0.436198
C  -0.354432 -2.750241 0.72205
C  -1.631311 -0.270929 0.256265
C  1.865254 -1.701248 0.749234
C  -1.658641 -2.796877 -0.089801
C  -2.366988 -1.452212 -0.033749
C  2.13036 0.632769 -0.264133
C  2.719491 -0.529885 0.284079
C  -2.328619 0.956796 0.376752
C  -3.763094 -1.363701 -0.253266
C  2.955045 1.715626 -0.660648
C  4.130903 -0.591125 0.431075
C  -3.719258 1.038105 0.180764
C  -4.444723 -0.134952 -0.175483
C  4.362326 1.668115 -0.528373
C  4.940608 0.483463 0.03124
C  -5.333225 2.388895 1.404299
C  -6.279051 0.698709 -1.543328
C  7.024207 -0.636107 0.689608
H  0.068905 0.02455 1.548414
H  0.278591 1.749443 -0.225863
H  0.336402 0.487226 -1.481395
H  -0.588317 -2.665227 1.815358
H  0.216327 -3.687072 0.580186
H  2.308889 -2.653499 0.397023
H  1.878226 -1.739845 1.874151
H  -2.323577 -3.593659 0.295086
H  -1.407594 -3.052581 -1.137736
H  -1.80406 1.880447 0.644287
H  -4.346541 -2.259783 -0.493651
H  2.491471 2.617512 -1.081771
H  4.583003 -1.493758 0.857779
H  6.207595 2.600732 -0.782626
H  4.835177 3.559778 -1.320559
H  -4.825315 2.259795 2.379302
H  -6.121364 1.622734 1.288916
H  -5.763642 3.399986 1.337369
H  -5.878974 0.271727 -2.4828
H  -5.940833 1.745099 -1.434572
H  -7.378632 0.645225 -1.545764
H  6.835497 -1.542604 0.0812
H  6.699133 -0.819205 1.732889
H  8.097959 -0.395826 0.672763
