program: Gaussian 09
title: 000191123
version: EM64L-G09RevD.01
frameworkgroup: C1[X(C14H16N7O)]
method: RPBEPBE
basis: SDD
operation: Freq
keyword: #p
keyword: freq=noraman
keyword: PBEPBE/SDD
title: #p freq=noraman PBEPBE/SDD
converged: YES YES NO NO
title: Mulliken charges:
elementType: O N N N N N N N C C C C C C C C C C C C C C H H H H H H H H H H H H H H H H
charge: -0.220455 -0.177107 -0.075120 -0.060866 -0.043131 -0.116110 -0.605171 -0.608816 -0.398184 -0.393385 -0.360402 0.181907 -0.088479 -0.239263 -0.244831 -0.101421 0.293476 0.192621 -0.172813 -0.291590 -0.363161 0.136174 0.267932 0.236933 0.262178 0.261066 0.281769 0.244885 0.291767 0.323699 0.284080 0.276488 0.299850 0.273715 0.350473 0.363001 0.377251 0.361041
chargesum: 1.00000
title: Mulliken charges with hydrogens summed into heavy atoms:
elementType: O N N N N N N N C C C C C C C C C C C C C C
charge: -0.220455 -0.177107 -0.075120 -0.060866 -0.043131 -0.116110 0.108303 0.129476 0.106680 0.129859 0.166251 0.181907 -0.088479 0.052503 0.078868 0.182659 0.293476 0.192621 0.103675 0.008260 -0.089446 0.136174
polarizability: 2.33803806e+02 -2.30210827e+01 1.83599495e+02 1.52176647e+01 2.76584943e+01 1.58348760e+02
1716.lowfreq: -9.5928 -5.4450 -0.0010 -0.0008 -0.0004 8.5173 37.5189 43.4279 64.6981
frequency: 37.4545 43.3570 64.6883 71.2441 82.7340 106.3060 134.7837 149.2329 161.1591 187.1108 198.1715 220.3522 261.2902 282.5778 297.9364 323.5858 334.6632 360.1545 389.9171 427.5427 452.4830 508.6135 532.0229 539.1860 559.4821 563.2351 568.7868 573.8154 597.9466 603.9935 622.1121 647.7673 668.3859 676.4219 685.3991 700.8328 707.7007 725.0011 746.7185 790.5768 811.0444 819.7776 828.7555 850.1028 866.0431 892.7339 901.7671 936.0923 938.1006 948.4555 960.6988 997.6726 1013.3458 1020.1292 1056.8610 1072.4723 1092.8856 1101.8904 1126.2233 1148.5021 1171.9967 1181.4072 1199.6218 1222.1973 1225.4710 1262.0319 1266.2173 1305.4202 1312.4422 1322.2850 1327.1860 1344.6888 1362.6351 1370.5824 1371.9504 1375.3599 1380.6996 1389.6082 1435.9520 1437.7657 1456.8092 1459.0847 1464.8662 1479.2473 1494.0997 1540.4027 1566.3315 1583.8275 1588.8502 1619.6488 1641.1361 1647.8939 3001.3037 3024.2386 3028.2038 3056.7397 3088.3058 3102.3221 3170.5168 3172.0595 3191.4423 3204.0156 3212.3291 3228.7925 3373.6980 3523.3432 3589.5255 3670.6773
redmass: 6.3484 4.9803 6.8063 6.7181 5.2251 6.0417 5.5956 5.1166 4.1721 5.0726 3.2947 5.2230 3.0499 3.7148 2.9863 3.4857 3.9240 4.1484 2.8573 3.2189 3.1072 8.7847 3.6077 3.4029 1.4427 2.1301 3.2914 3.3520 1.3305 3.8418 1.3950 3.7473 7.4043 2.1897 5.6114 6.1240 3.7807 1.7457 1.9703 5.9297 1.5470 3.1600 1.5749 4.8128 2.1165 2.3995 1.6566 1.4000 1.5761 2.1115 2.3061 1.3808 5.3907 3.4752 2.4567 2.6361 1.8618 1.8834 1.9616 2.4352 3.7037 1.9131 1.1955 1.6885 2.0573 1.2385 1.8703 6.1592 4.8381 1.3945 1.8558 1.8089 1.3797 1.9273 2.9644 2.7852 1.7657 2.1567 2.0288 2.6655 1.1398 1.6500 1.5578 1.6365 1.7836 7.1827 5.5745 2.1065 3.3463 3.4645 2.3046 1.6927 1.0626 1.0628 1.0620 1.0982 1.1055 1.1043 1.0923 1.0928 1.0929 1.0951 1.1003 1.0990 1.0582 1.0454 1.0940 1.1052
irintensity: 4.9045 0.1937 0.5799 3.0916 1.5224 9.1445 13.6708 17.4829 0.5930 4.1004 3.1083 1.1678 5.5384 2.6628 0.7010 2.6445 1.0353 14.9282 3.5073 3.7260 2.6034 3.5260 1.8225 6.2945 1.3976 2.4121 7.4415 11.1748 147.1843 20.4363 2.2374 78.5109 10.2587 40.9325 5.7862 7.1096 2.3533 94.0684 214.4186 20.6195 20.2338 2.5304 13.6543 3.1070 5.7208 4.1780 6.7697 9.2010 10.1575 14.0154 0.5208 0.4710 6.6878 3.7295 7.7537 0.2651 2.8184 6.3876 5.7769 16.7155 38.7141 19.2287 1.4975 27.5493 28.1411 3.9298 10.7838 30.9837 35.2664 7.5728 25.6153 12.3989 1.6476 56.7430 35.9244 43.7460 4.4568 2.0300 12.9411 47.9863 26.5421 17.2195 24.0736 29.2174 17.4086 51.5186 0.5697 35.9579 84.5206 15.0528 495.7616 282.5821 9.7838 12.2456 5.9427 14.4678 2.4389 3.2267 0.2851 3.1394 1.5186 11.5060 0.7821 1.5514 168.0614 173.8850 132.7080 58.3512
temp: 298.150 k
press: 1.00000 atm
elementType: 8 7 7 7 7 7 7 7 6 6 6 6 6 6 6 6 6 6 6 6 6 6 1 1 1 1 1 1 1 1 1 1 1 1 1 1 1 1
symmnumber: 1
zpe: 792128.4 jmol-1
zpe.correction: 0.301706 hartree
zpe.thermalcorrener: 0.320241 hartree
zpe.thermalcorrenthalpy: 0.321185 hartree
zpe.thermalcorrgfe: 0.255180 hartree
zpe.sumelectzpe: -999.801284 hartree
zpe.sumelectthermal: -999.782749 hartree
zpe.sumelectthermalent: -999.781804 hartree
zpe.sumelectthermalfe: -999.847810 hartree
dipole: 4.1587 -1.4330 3.7632
dipole: 5.7887
quadrupole: -87.9204 -106.3285 -113.0396
quadrupole: -29.1260 -4.6015 3.4431
quadrupole: 14.5091 -3.8990 -10.6101 -29.1260 -4.6015 3.4431
hfenergy: -1000.1029898 hartree
pointgroup: C01 [X(C14H16N7O1)]
dipole: -0.3934866 -2.1074595 0.7685136 debye
polarizability: 152.564818|-10.680162|238.0136403|27.2958417|16.8280474|185.1736037 unknown
InChI: InChI=1S/C14H16N7O/c15-12-11-14(18-8-17-12)21(9-19-11)6-2-5-20-4-1-3-10(7-20)13(16)22/h1,3-4,7-9H,2,5-6,15-16H2
charge 1 multiplicity 1
38 atoms
O  -3.257985 2.685499 -1.01625
N  1.440832 -1.670468 -0.722061
N  -1.691855 -1.197146 -0.58209
N  2.170594 -1.201045 1.408114
N  0.98863 0.638989 -1.510844
N  1.352086 2.30188 0.264528
N  2.210965 1.74542 2.398561
N  -1.506852 3.522798 0.299372
C  -0.383074 -3.116954 -1.711932
C  0.993039 -2.430635 -1.904211
C  -1.626352 -2.198613 -1.713953
C  1.394503 -0.279921 -0.585755
C  1.839429 -0.013162 0.736709
C  1.920074 -2.168432 0.504409
C  -1.888729 0.129601 -0.866911
C  -1.576868 -1.627418 0.726346
C  -1.9113 1.096061 0.158954
C  1.817494 1.353193 1.154926
C  -1.5982 -0.707173 1.77659
C  -1.736519 0.676012 1.496143
C  1.009101 1.906403 -1.003641
C  -2.268701 2.517144 -0.241711
H  -0.530213 -3.812568 -2.560288
H  -0.361313 -3.754027 -0.807439
H  1.747922 -3.202304 -2.133638
H  0.967305 -1.722081 -2.751179
H  -2.540858 -2.815858 -1.653707
H  -1.666772 -1.617718 -2.649824
H  2.093423 -3.22991 0.672828
H  -2.038757 0.410557 -1.910589
H  -1.466775 -2.700746 0.8867
H  -1.500434 -1.070916 2.801616
H  -1.744885 1.408294 2.309107
H  0.701085 2.706429 -1.683086
H  2.250897 2.738982 2.623948
H  2.595874 1.060877 3.049097
H  -0.55815 3.348894 0.662001
H  -1.777664 4.486064 0.088161
