program: Gaussian 09
title: 000191120
version: EM64L-G09RevD.01
frameworkgroup: C1[X(C10H8O3)]
method: RPBEPBE
basis: SDD
operation: Freq
keyword: #pfreq=noraman
keyword: PBEPBE/SDD
title: #p freq=noraman PBEPBE/SDD
converged: YES YES NO NO
title: Mulliken charges:
elementType: O O O C C C C C C C C C C H H H H H H H H
charge: -0.212935 -0.223523 -0.200379 0.289320 -0.541373 0.056600 -0.322726 0.188294 0.160895 -0.346965 -0.344422 -0.224096 -0.209159 0.224065 0.258197 0.222141 0.239118 0.283964 0.281906 0.246622 0.174457
chargesum: 0.00000
title: Mulliken charges with hydrogens summed into heavy atoms:
elementType: O O O C C C C C C C C C C
charge: -0.212935 -0.223523 -0.200379 0.289320 -0.059111 0.056600 0.138533 0.188294 0.160895 -0.063001 -0.062516 0.022526 -0.034702
polarizability: 1.54249762e+02 5.92684737e+00 1.32245081e+02 -1.58292502e+00 2.21471928e+00 5.48508197e+01
1716.lowfreq: -3.1059 -0.0009 -0.0008 -0.0008 2.0990 11.9083 68.1181 95.5666 132.7874
frequency: 68.1169 95.5619 132.7869 184.0425 195.5525 219.2450 291.6758 306.5845 345.7403 427.4985 468.7028 473.5913 492.5019 515.0382 583.1226 622.3000 686.6676 720.0028 749.4909 788.6181 834.6524 841.8575 917.9862 931.2508 960.6158 986.9281 1016.8888 1019.3740 1047.5382 1072.8149 1081.8916 1177.5231 1192.7141 1200.7843 1222.3509 1248.3242 1259.3017 1329.2025 1372.8410 1374.3225 1406.0056 1438.4273 1449.4776 1451.9190 1476.7112 1579.2545 1588.4595 1613.0595 1648.1122 2914.2838 2988.2205 3008.7885 3066.8392 3110.1574 3142.9651 3155.4367 3172.4554
redmass: 8.1019 4.4075 3.0456 4.7664 5.9630 2.6068 2.6801 4.9292 10.4358 4.2052 4.4311 5.6868 4.1062 4.8951 7.3988 2.7361 6.1841 6.0632 2.6705 3.3790 1.7394 3.9385 4.0722 2.5429 1.5658 1.5630 1.7457 1.9758 3.0554 2.2221 2.6890 1.1617 1.2959 1.7894 1.6533 4.9235 1.4306 1.5928 1.8817 1.5845 2.1712 1.5101 1.7113 2.4252 1.1040 7.2173 6.8209 7.0885 11.6366 1.0844 1.0665 1.0648 1.0946 1.1014 1.0874 1.0918 1.0994
irintensity: 13.0722 1.4334 2.2736 2.2750 6.6571 11.7314 2.6825 8.5521 1.6252 6.5594 6.2267 1.5902 5.6231 0.7303 4.2563 13.1812 11.1523 17.6478 28.6103 7.0319 28.8643 7.2835 31.4669 28.5726 2.8371 2.3298 9.6652 21.5138 103.0535 31.5800 20.2711 2.9134 10.9140 7.4156 19.9006 138.0961 59.4251 9.8982 0.1538 10.6649 19.7846 32.2564 3.8484 8.4861 13.6196 66.6719 35.2184 222.3848 214.6547 90.3079 11.2021 40.0266 20.3562 21.8532 0.7398 1.7936 11.5405
temp: 298.150 k
press: 1.00000 atm
elementType: 8 8 8 6 6 6 6 6 6 6 6 6 6 1 1 1 1 1 1 1 1
symmnumber: 1
zpe: 410717.3 jmol-1
zpe.correction: 0.156434 hartree
zpe.thermalcorrener: 0.166945 hartree
zpe.thermalcorrenthalpy: 0.167890 hartree
zpe.thermalcorrgfe: 0.119984 hartree
zpe.sumelectzpe: -610.611245 hartree
zpe.sumelectthermal: -610.600734 hartree
zpe.sumelectthermalent: -610.599789 hartree
zpe.sumelectthermalfe: -610.647694 hartree
dipole: -1.3089 -1.7086 1.0199
dipole: 2.3817
quadrupole: -107.4639 -61.2135 -74.3093
quadrupole: -8.9188 2.8459 0.8334
quadrupole: -26.4683 19.7820 6.6863 -8.9188 2.8459 0.8334
hfenergy: -610.7676789 hartree
pointgroup: C01 [X(C10H8O3)]
dipole: 0.5485664 -0.664583 -0.3680062 debye
dipolederiv: -0.5436217 -0.1322098 -0.0508732 -0.0092588 -1.2508585 -0.1998128 -0.0124558 -0.0706509 -0.3247227 -0.9840097 0.2724759 0.0667231 0.2408143 -0.7646287 -0.0985195 0.0685032 -0.0932989 -0.3576395 -1.1848718 0.2525434 -0.0542171 -0.0366729 -0.3902334 0.0131857 -0.0157271 0.0216003 -0.3288215 0.2750192 -0.0396421 -0.0003413 0.075709 0.2393591 -0.0456428 -0.0843086 -0.0892866 -0.0257954 -0.0963653 -0.032424 -0.0395362 -0.0880787 -0.0760967 0.0037232 -0.0618602 0.0225567 0.0583962 -0.4827829 -0.0693535 -0.0053736 -0.094333 -0.3694225 0.008699 -0.0122529 0.0271919 -0.0189404 0.3937814 -0.1910589 -0.0652388 -0.039446 0.5008032 0.0913602 0.0607912 0.1257489 0.3840846 -0.5292511 0.1371269 -0.0281599 0.3616119 -0.5058867 0.073879 -0.0516409 0.0775971 -0.0102736 1.5548202 0.120146 -0.0242038 -0.0023779 1.5871106 0.2443632 -0.0708283 0.1202207 0.2875035 0.160387 -0.0539569 0.0127687 0.1435429 0.1065689 -0.0225643 0.0090132 0.0055054 -0.0753108 0.0777996 0.0617511 -0.0105673 -0.2126161 0.096885 -0.0336243 0.0379851 -0.0236684 -0.0732956 -0.3673005 0.0992593 -0.0193613 0.1259116 0.1577102 -0.0331386 -0.0192044 -0.0371286 -0.1519174 1.4189165 -0.3629221 0.0740975 -0.4063444 0.8441715 -0.1405622 0.0843158 -0.1362583 0.1362352 -0.0157306 0.129645 0.0503537 0.0503494 -0.0004001 -0.0346102 0.02937 -0.0530726 0.0796333 0.0786328 -0.0589491 0.020995 -0.0451705 0.0232216 0.0267677 0.0014249 0.0419598 -0.0751604 0.0360174 0.0912138 0.0464094 0.0440307 0.0461835 0.0521971 0.0105702 -0.0522023 -0.1469824 0.0179143 -0.0736017 0.009245 -0.0645479 -0.1162794 -0.0068509 0.0235813 0.0334438 0.0940156 0.0727307 0.0821075 -0.0123679 0.0353536 0.071478 0.0122666 -0.0074454 0.0018448 0.1510817 0.0173884 -0.0657421 0.0045827 -0.0149898 0.1086388 0.0041687 -0.0037342 0.0055442 0.1490806 0.070226 -0.0416152 0.0029046 -0.0389047 -0.0829767 0.0286318 0.0008332 0.0285172 0.1560051 0.0303 -0.1247936 0.0221607 -0.0245828 -0.2253479 0.0560836 0.0130696 0.0438358 0.0928238 unknown
polarizability: 154.6103289|-5.087074|131.7127214|1.6785017|-4.3569046|55.0226126 unknown
InChI: InChI=1S/C10H8O3/c11-6-7-2-1-3-9-8(7)4-5-13-10(9)12/h1-3,6H,4-5H2
charge 0 multiplicity 1
21 atoms
O  -2.607243 -1.133047 -0.013977
O  -3.152971 1.069804 0.253719
O  3.924455 -0.657718 0.249311
C  0.220545 -0.432323 0.119141
C  -0.238913 -1.876172 0.279109
C  -0.791851 0.562087 -0.009957
C  -1.558794 -2.086399 -0.472552
C  1.586469 -0.019812 0.109166
C  -2.252594 0.223046 0.076291
C  -0.44991 1.929214 -0.16043
C  1.912657 1.355495 -0.056264
C  0.903463 2.326261 -0.192846
C  2.706794 -0.984436 0.283633
H  0.501782 -2.59574 -0.110576
H  -0.385596 -2.109771 1.352571
H  -1.422838 -1.950782 -1.562738
H  -1.991557 -3.079331 -0.27759
H  -1.262348 2.659028 -0.238459
H  2.974215 1.627221 -0.06609
H  1.164179 3.382204 -0.313525
H  2.425754 -2.048428 0.464662
