program: Gaussian 09
title: 000191115
version: EM64L-G09RevD.01
frameworkgroup: C1[X(C16H26N4O4)]
method: RPBEPBE
basis: SDD
operation: Freq
keyword: #p
keyword: freq=noraman
keyword: PBEPBE/SDD
title: #p freq=noraman PBEPBE/SDD
converged: YES YES NO NO
title: Mulliken charges:
elementType: O O O O N N N N C C C C C C C C C C C C C C C C H H H H H H H H H H H H H H H H H H H H H H H H H H
charge: -0.354618 -0.259750 -0.285736 -0.244746 -0.145662 -0.397862 -0.377137 -0.616909 -0.184902 -0.493172 -0.371766 -0.488073 -0.152225 0.199386 -0.398353 0.011394 -0.178305 0.206380 -0.455240 0.180860 -0.516054 -0.723960 -0.735875 0.151310 0.300423 0.273783 0.225824 0.241833 0.243874 0.235718 0.262726 0.276908 0.199300 0.215585 0.218270 0.259143 0.352779 0.241310 0.223191 0.253733 0.243761 0.350570 0.213357 0.220385 0.206920 0.262170 0.217068 0.191313 0.377018 0.324055
chargesum: 0.00000
title: Mulliken charges with hydrogens summed into heavy atoms:
elementType: O O O O N N N N C C C C C C C C C C C C C C C C
charge: -0.354618 -0.259750 -0.285736 -0.244746 -0.145662 -0.045083 -0.026567 0.084164 0.115520 0.006436 0.113941 0.010371 0.124683 0.199386 0.016532 0.229665 0.080838 0.206380 0.009261 0.180860 -0.018561 -0.083299 -0.065325 0.151310
polarizability: 2.46867287e+02 -5.29655001e+00 1.91918509e+02 1.56947983e-01 7.54944020e+00 1.88079308e+02
1716.lowfreq: -12.4639 -8.3052 -0.0008 -0.0007 -0.0002 4.0900 17.1316 26.7251 31.9048
frequency: 16.9928 26.6777 31.8172 40.5530 44.5495 51.2975 62.2718 74.5110 95.4163 112.1556 120.9087 127.6463 146.3217 156.4087 160.5687 194.9941 204.2273 223.2192 227.7277 240.1552 243.8086 281.7672 301.6446 325.8056 331.0656 356.3332 391.9658 404.9167 412.9711 438.0892 468.1880 474.9007 502.2662 512.8029 538.2650 563.3988 598.2947 601.2976 636.2106 651.5618 675.7039 679.1835 686.9526 699.3790 711.8595 759.4961 790.8716 795.1315 818.2648 824.1785 841.4547 856.9585 866.3047 880.8471 905.3199 911.9262 921.3850 923.5875 949.3577 955.6885 969.2385 984.3408 994.0142 1004.4946 1010.8874 1042.0454 1073.4777 1085.7274 1091.2514 1114.9556 1117.7478 1126.2544 1129.1717 1144.8649 1157.9615 1168.2744 1176.5016 1182.7669 1198.2379 1221.2178 1232.3063 1245.3218 1248.2151 1256.7773 1269.2668 1270.5446 1290.2208 1290.5328 1295.6735 1304.3702 1311.6048 1319.5530 1324.0144 1326.2174 1329.6023 1335.2448 1338.9883 1355.2062 1375.7454 1379.4285 1395.4431 1406.0115 1450.0787 1451.8284 1454.8266 1465.5823 1472.5248 1475.2330 1475.7770 1480.0800 1483.7625 1485.5204 1499.3124 1547.2412 1600.7866 1608.5349 1645.8435 1670.0199 2922.2244 2962.3838 2965.2896 2969.0599 2982.8134 2986.5658 3012.2869 3015.3808 3016.5257 3023.5835 3030.3973 3031.5597 3049.2181 3057.7671 3060.1232 3064.3853 3072.5782 3079.7253 3081.7145 3099.1509 3099.7419 3112.6129 3334.9992 3474.7778 3563.0308 3607.3237
redmass: 5.5547 4.5459 4.7138 5.0537 3.5778 3.4403 4.7482 6.6179 5.2130 3.4224 4.3327 4.8175 3.0644 2.5765 3.1874 2.7713 1.3661 3.1087 1.7614 4.0712 1.7521 3.0262 3.1997 7.7835 3.7346 3.4037 2.6851 2.9425 2.6048 3.7340 4.0015 3.3389 2.5291 2.3935 3.4468 3.2044 1.7965 2.1030 2.4778 2.2287 1.4226 2.5871 4.2757 2.9682 4.9398 3.7689 1.2886 2.4592 2.2933 2.7623 2.5893 2.4992 1.9342 2.5808 1.9626 2.0186 1.2159 2.3715 1.6667 1.8811 2.6626 2.8827 2.1108 2.2673 2.3268 2.0922 1.4562 3.3858 2.0364 1.7429 1.9086 2.6646 2.8305 1.8964 2.3480 1.3159 1.7735 1.5700 1.3304 1.4465 1.3705 1.3000 1.8428 1.4777 1.3762 1.5611 1.3352 1.3723 1.3917 1.4426 1.3464 1.5206 1.3931 1.5310 1.5295 1.3525 1.4784 2.5421 2.1625 1.2098 1.2180 6.8736 1.1141 1.0959 1.0841 1.0834 1.0546 1.1046 1.1332 1.0621 1.9090 1.1017 1.0478 4.1313 5.2031 1.5450 5.7272 9.2578 1.0824 1.0588 1.0378 1.0408 1.0787 1.0624 1.0603 1.0664 1.0730 1.0984 1.0724 1.0677 1.0871 1.0981 1.0993 1.0985 1.0990 1.1026 1.0992 1.1028 1.1000 1.1028 1.0601 1.0768 1.0785 1.0926
irintensity: 3.8523 0.8930 0.5663 0.8997 2.1908 1.7944 0.7453 3.4514 4.7326 7.0627 1.3435 0.6504 0.8373 0.6150 0.3923 3.9262 1.2221 6.0551 5.4087 26.7965 3.2174 8.1042 11.1514 8.3119 0.5616 1.6433 7.1163 19.4053 3.4773 13.5691 16.4373 8.0258 19.1927 2.9520 5.7279 34.6067 65.1549 46.3556 14.2220 102.4317 47.4328 126.8024 13.5086 23.1391 11.4143 10.7753 132.3382 22.7500 4.0431 4.3331 8.0356 1.3212 3.8180 4.9294 0.5566 7.4386 4.5240 10.3803 0.7445 6.6624 2.2786 6.4374 15.2818 0.4703 15.5651 4.2930 4.8535 2.5349 1.8591 12.9936 0.9277 8.7361 2.7200 5.9058 34.7812 13.2486 12.9938 2.7028 12.6817 6.4625 34.9852 16.5763 96.7008 9.2125 2.7911 12.6056 24.2818 9.2830 9.5419 0.8686 3.4256 9.0202 12.3219 2.3630 16.5984 10.5675 2.6576 45.4151 78.2762 20.7248 21.7005 177.7373 49.7122 18.3269 9.7014 38.1454 4.8563 62.7821 21.1798 7.6100 312.0166 4.5514 15.9707 309.1017 85.1107 127.2099 300.6556 492.5243 39.7299 17.1095 27.4767 35.0129 29.5010 29.3874 32.1256 9.7272 8.9628 13.8398 29.4955 19.0176 13.1620 12.2732 16.2913 78.8262 51.2140 17.2462 24.6187 19.0132 18.2162 9.6925 204.2349 64.3356 56.8093 66.0967
temp: 298.150 k
press: 1.00000 atm
elementType: 8 8 8 8 7 7 7 7 6 6 6 6 6 6 6 6 6 6 6 6 6 6 6 6 1 1 1 1 1 1 1 1 1 1 1 1 1 1 1 1 1 1 1 1 1 1 1 1 1 1
symmnumber: 1
zpe: 1098672.6 jmol-1
zpe.correction: 0.418462 hartree
zpe.thermalcorrener: 0.443429 hartree
zpe.thermalcorrenthalpy: 0.444373 hartree
zpe.thermalcorrgfe: 0.360992 hartree
zpe.sumelectzpe: -1143.423922 hartree
zpe.sumelectthermal: -1143.398956 hartree
zpe.sumelectthermalent: -1143.398012 hartree
zpe.sumelectthermalfe: -1143.481393 hartree
dipole: -3.6895 1.4950 -2.6454
dipole: 4.7797
quadrupole: -203.9209 -142.7101 -136.4854
quadrupole: 6.2344 -25.4727 0.9792
quadrupole: -42.8821 18.3287 24.5534 6.2344 -25.4727 0.9792
hfenergy: -1143.8423847 hartree
pointgroup: C01 [X(C16H26N4O4)]
dipole: 1.5317025 0.5390994 0.9483626 debye
polarizability: 247.2609622|0.1077735|190.2148698|-2.5712936|-7.7109981|189.3892722 unknown
InChI: InChI=1S/C16H26N4O4/c1-9(2)8-11(19-15(23)10-5-6-13(21)18-10)16(24)20-7-3-4-12(20)14(17)22/h9-12,18-19H,3-8,17H2,1-2H3
charge 0 multiplicity 1
50 atoms
O  1.028627 -1.066328 1.36205
O  5.497818 -1.526111 0.56067
O  -2.148896 1.28964 -1.367112
O  -6.416716 -1.132074 -0.818911
N  2.312491 -0.717863 -0.545007
N  -0.949643 0.521702 0.479761
N  -4.517593 0.217334 -0.425082
N  3.72418 -1.46261 2.075234
C  3.194046 -1.905635 -0.288475
C  3.847547 -2.167702 -1.659444
C  2.627156 -0.066525 -1.854973
C  3.938435 -0.756541 -2.2942
C  0.382666 0.79805 -0.079737
C  1.269801 -0.408299 0.27888
C  1.019773 2.092434 0.517128
C  0.277406 3.40717 0.162324
C  -3.407706 0.352845 0.523132
C  4.259281 -1.60583 0.817054
C  -3.401662 -1.032427 1.252894
C  -2.113524 0.748908 -0.216026
C  -4.866929 -1.520603 1.122786
C  0.883123 4.574966 0.977343
C  0.318133 3.709461 -1.354499
C  -5.392416 -0.825823 -0.152915
H  2.556509 -2.737027 0.064814
H  4.841167 -2.624787 -1.536821
H  3.207175 -2.833974 -2.265038
H  1.808266 -0.259482 -2.575123
H  2.739059 1.025344 -1.739108
H  4.035851 -0.783811 -3.39172
H  4.811586 -0.226882 -1.876635
H  0.262022 0.908322 -1.171596
H  2.070483 2.170568 0.167582
H  1.060106 1.969788 1.618121
H  -0.784875 3.291976 0.460004
H  -3.616512 1.161689 1.259015
H  -0.941975 -0.038551 1.340761
H  -2.724533 -1.727412 0.724039
H  -3.065044 -0.950649 2.300352
H  -4.965304 -2.612881 1.022363
H  -5.491167 -1.205891 1.980149
H  -4.573569 0.805521 -1.258907
H  0.8266 4.38419 2.065606
H  0.347029 5.518996 0.769487
H  1.947997 4.729414 0.715215
H  -0.238492 2.951915 -1.9334
H  -0.149441 4.688676 -1.56545
H  1.363405 3.753478 -1.720559
H  2.698995 -1.476427 2.195021
H  4.350862 -1.262143 2.854951
