program: Gaussian 09
title: 000191114
version: EM64L-G09RevD.01
frameworkgroup: C1[X(C5H10O4)]
method: RPBEPBE
basis: SDD
operation: Freq
keyword: #pfreq=noraman
keyword: PBEPBE/SDD
title: #p freq=noraman PBEPBE/SDD
converged: YES YES NO NO
title: Mulliken charges:
elementType: O O O O C C C C C H H H H H H H H H H
charge: -0.482158 -0.468495 -0.470564 -0.219262 -0.027089 -0.117115 -0.126373 -0.722974 -0.082423 0.202224 0.232877 0.227139 0.197321 0.295341 0.231220 0.240363 0.372082 0.350321 0.367567
chargesum: 0.00000
title: Mulliken charges with hydrogens summed into heavy atoms:
elementType: O O O O C C C C C
charge: -0.110076 -0.118174 -0.102998 -0.219262 0.175135 0.115761 0.100765 0.000909 0.157940
polarizability: 8.42409008e+01 3.58472345e-01 6.84768696e+01 -1.89543094e+00 -2.55467753e+00 5.14952814e+01
1716.lowfreq: -4.0790 0.0005 0.0005 0.0008 6.7157 10.0527 57.1835 76.7021 119.2453
frequency: 57.1636 76.6376 119.2403 177.8114 253.7785 265.8598 294.5555 310.3898 323.9199 331.7519 360.8903 431.8187 484.5814 499.1092 544.6503 633.7136 731.1859 822.8606 826.1092 888.7152 952.7265 1005.2457 1020.3639 1050.8234 1074.7842 1099.0077 1128.7365 1207.8134 1224.2742 1251.6784 1284.7027 1286.7803 1321.7052 1341.5069 1354.6481 1358.9893 1396.2274 1397.5165 1466.3824 1481.7749 1605.6945 2944.7715 2961.2847 2976.5537 3025.9524 3038.5379 3075.1128 3106.4360 3383.2472 3426.4779 3560.5487
redmass: 4.3078 5.8217 5.3793 3.8540 1.1279 3.1009 4.7254 1.7883 1.7954 3.5653 4.5030 3.3602 1.9181 1.5961 2.8915 1.0860 4.6184 2.2133 3.2752 2.4439 1.8925 3.3561 1.7437 2.8448 2.9308 2.7657 2.0412 1.3768 1.3114 1.3411 1.2144 1.1848 1.1783 1.2858 1.3607 1.1869 1.5385 1.2515 1.0505 1.0484 7.8927 1.0799 1.0854 1.0403 1.0910 1.0862 1.0948 1.1002 1.0642 1.0642 1.0661
irintensity: 2.4080 3.4186 5.9443 7.0787 0.7579 3.4209 36.5188 47.2049 34.2151 5.2440 14.3102 1.3021 47.9101 69.6682 37.1094 177.4687 20.6583 14.3410 59.1306 20.1973 12.2398 130.6233 39.4312 14.2933 55.8526 17.1437 39.1108 3.4835 16.4547 8.1761 15.3886 62.2909 63.3874 49.3376 9.2337 47.9330 14.6571 55.0780 12.1891 12.7963 133.3362 2.4338 64.0406 27.4418 29.5267 21.2747 42.3752 5.3967 44.8727 67.0900 9.3028
temp: 298.150 k
press: 1.00000 atm
elementType: 8 8 8 8 6 6 6 6 6 1 1 1 1 1 1 1 1 1 1
symmnumber: 1
zpe: 396233.4 jmol-1
zpe.correction: 0.150917 hartree
zpe.thermalcorrener: 0.161278 hartree
zpe.thermalcorrenthalpy: 0.162222 hartree
zpe.thermalcorrgfe: 0.115370 hartree
zpe.sumelectzpe: -496.650336 hartree
zpe.sumelectthermal: -496.639975 hartree
zpe.sumelectthermalent: -496.639030 hartree
zpe.sumelectthermalfe: -496.685883 hartree
dipole: -2.5555 0.3744 -0.7220
dipole: 2.6818
quadrupole: -59.5549 -57.4738 -51.3588
quadrupole: -2.4527 6.9849 -0.3713
quadrupole: -3.4257 -1.3446 4.7704 -2.4527 6.9849 -0.3713
hfenergy: -496.8012528 hartree
pointgroup: C01 [X(C5H10O4)]
dipole: 1.0490496 0.1126351 0.0039329 debye
dipolederiv: -0.4673591 0.0470497 0.0576617 0.0689828 -0.5921207 -0.1077974 -0.0088489 -0.09701 -0.7757186 -0.8729884 0.0596423 -0.2204706 0.0758547 -0.4359591 -0.2435616 -0.2342785 -0.2202572 -0.5056497 -0.4411223 -0.0920758 0.0432419 -0.1308187 -0.4948132 -0.1294691 -0.0072943 -0.1002878 -0.6839947 -0.7745528 0.1557127 -0.1290232 0.2384278 -0.3792312 0.0248833 -0.3633923 0.0655967 -0.5928759 0.2701279 -0.0210583 -0.0530543 0.1803376 0.273193 0.025672 0.1142085 -0.0424606 0.5383282 0.6135576 0.0850825 0.1954747 0.0149545 0.3508536 0.0899486 0.1155988 0.1034975 0.3568112 -0.2759066 0.2386761 -0.0884012 0.3246691 0.1998861 0.01808 -0.0116716 0.0518513 0.5235829 -0.0774997 -0.0025588 0.0375573 -0.0017013 0.0570522 -0.0856423 -0.0206698 -0.0966132 -0.1958563 0.9324883 -0.3453604 0.2314233 -0.5443652 0.2880521 -0.044807 0.255409 -0.0049427 0.5672242 -0.0255536 -0.0412578 0.0327724 -0.0555643 -0.1057239 0.0997317 0.025122 0.087614 -0.1082803 -0.0005463 -0.063436 0.00528 -0.0526676 -0.0848852 0.0422318 0.0111906 0.0784299 -0.0132834 0.0718838 0.0065929 0.0040306 -0.0356832 -0.0460059 0.0968419 0.051563 0.0624691 -0.0605612 0.0688346 -0.0310752 0.0452576 -0.0828403 -0.1363096 0.0845505 0.0235545 0.0258523 0.0534416 0.1419767 -0.0542841 -0.060543 -0.0518798 0.0888127 -0.0395289 -0.056218 -0.0350857 0.0489822 -0.1009094 0.1271756 0.0371809 0.1177817 0.0267058 0.0137891 -0.0055515 0.0164921 0.0779299 0.0901053 0.0516429 0.0421402 0.0619225 0.0880812 -0.057667 0.0554599 -0.0669962 -0.0886773 0.2903375 -0.0606983 -0.0988219 -0.0790837 0.3573032 0.0141887 -0.0396824 0.0077771 0.3422884 0.3105878 -0.0665412 0.0559719 -0.098316 0.2074953 0.1079691 0.1019036 0.1448369 0.18629 0.2465385 0.0067711 -0.1376785 0.0499893 0.3376136 0.0905864 -0.0064027 0.0192365 0.3300187 unknown
polarizability: 82.0452743|-5.0637815|53.1847137|5.3587217|3.9019649|68.9830637 unknown
InChI: InChI=1S/C5H10O4/c1-3(7)5(9)4(8)2-6/h2-5,7-9H,1H3
charge 0 multiplicity 1
19 atoms
O  0.120872 0.860138 1.684921
O  2.678698 0.270259 1.303971
O  -0.63671 -0.685932 -1.599732
O  -2.817279 0.733933 -0.98316
C  0.452611 0.471606 0.310465
C  1.758195 -0.373382 0.319972
C  -0.78272 -0.317041 -0.204732
C  2.413178 -0.532914 -1.052525
C  -2.057547 0.501955 -0.005639
H  0.60061 1.37149 -0.32666
H  1.543049 -1.356087 0.77731
H  -0.877294 -1.229002 0.425768
H  2.705371 0.45222 -1.468547
H  1.695071 -0.98604 -1.756094
H  3.312703 -1.168924 -0.983238
H  -2.261878 0.871765 1.018468
H  1.00045 0.94372 2.152325
H  3.255625 0.919575 0.826678
H  -1.440807 -0.323839 -2.075147
