program: Gaussian 09
title: 000191105
version: EM64L-G09RevD.01
frameworkgroup: C1[X(C2H2N2)]
method: RPBEPBE
basis: SDD
operation: Freq
keyword: #p
keyword: freq=noraman
keyword: PBEPBE/SDD
title: #p freq=noraman PBEPBE/SDD
converged: NO NO NO NO
title: Mulliken charges:
elementType: N N C C H H
charge: -0.088270 -0.257865 -0.023652 -0.150204 0.259416 0.260574
chargesum: 0.00000
title: Mulliken charges with hydrogens summed into heavy atoms:
elementType: N N C C
charge: -0.088270 0.002710 -0.023652 0.109212
polarizability: 4.99041543e+01 1.90808263e+00 2.98775884e+01 1.05060832e-04 1.04221497e-04 1.53178346e+01
1716.lowfreq: -0.0010 -0.0009 -0.0003 10.9859 24.8143 48.1900 407.8231 446.3503 596.8282
frequency: 407.8210 446.3327 596.8233 809.5238 829.3213 888.0890 1071.3374 1149.8236 1396.9165 1886.0962 3167.1824 3347.1195
redmass: 3.8419 4.3173 9.3896 1.3427 1.2788 1.8250 1.3653 2.2196 7.6521 7.6394 1.1153 1.0773
irintensity: 57.7016 4.4349 30.9277 72.4779 51.7337 13.0313 192.5639 25.8764 3.9110 197.8926 2.9045 3.7287
temp: 298.150 k
press: 1.00000 atm
elementType: 7 7 6 6 1 1
symmnumber: 1
zpe: 95679.6 jmol-1
zpe.correction: 0.036442 hartree
zpe.thermalcorrener: 0.040265 hartree
zpe.thermalcorrenthalpy: 0.041209 hartree
zpe.thermalcorrgfe: 0.010949 hartree
zpe.sumelectzpe: -186.502586 hartree
zpe.sumelectthermal: -186.498764 hartree
zpe.sumelectthermalent: -186.497819 hartree
zpe.sumelectthermalfe: -186.528079 hartree
dipole: -1.1305 -0.5671 0.0001
dipole: 1.2647
quadrupole: -22.6089 -23.5570 -23.0247
quadrupole: 7.9864 0.0001 -0.0001
quadrupole: 0.4546 -0.4935 0.0388 7.9864 0.0001 -0.0001
hfenergy: -186.5390286 hartree
pointgroup: C01 [X(C2H2N2)]
dipole: 0.4221322 -0.2609666 0.0358045 debye
dipolederiv: -0.8764813 -0.053495 -0.0526413 -0.1039905 -0.2051005 -0.0071162 -0.0517914 -0.0033148 -0.1659968 -1.169156 0.0755542 -0.0575654 -0.1549455 -0.0286602 -0.0179262 -0.0538381 -0.0006723 -0.4208692 1.6047746 -0.1084107 0.1176711 0.2486184 0.1379136 0.0173149 0.1118548 -0.0094328 0.065916 0.0999325 -0.0469583 0.0049209 -0.2230922 0.0575463 -0.0168952 0.0077637 -0.0036948 0.0448208 0.0239673 0.1328247 -0.0140918 0.0851067 0.0701423 0.008208 -0.0132928 0.0117623 0.182225 0.3169629 0.0004851 0.0017066 0.1483032 -0.0318414 0.0164146 -0.0006962 0.0053524 0.293904 unknown
polarizability: 49.221935|-3.5885393|30.3568844|2.5977898|-0.5133354|15.5207579 unknown
InChI: InChI=1S/C2H2N2/c3-2-1-4-2/h1,3H
charge 0 multiplicity 1
6 atoms
N  0.883765 0.538175 -0.008513
N  -1.761418 -0.182473 -0.194918
C  -0.485655 -0.196499 -0.09911
C  0.78344 -0.810952 0.005923
H  1.467287 -1.660712 0.070843
H  -2.188217 0.76446 -0.242326
