program: Gaussian 09
title: 000191101
version: EM64L-G09RevD.01
frameworkgroup: C1[X(C15H14O2S)]
method: RPBEPBE
basis: SDD
operation: Freq
keyword: #p
keyword: freq=noraman
keyword: PBEPBE/SDD
title: #p freq=noraman PBEPBE/SDD
converged: YES YES NO NO
title: Mulliken charges:
elementType: S O O C C C C C C C C C C C C C C C H H H H H H H H H H H H H H
charge: 0.896621 -0.546896 -0.567891 0.458711 0.275154 0.277889 -0.659540 -0.409206 -0.388282 -0.382636 -0.372001 -0.742887 -0.223658 -0.234609 -0.221036 -0.233780 -0.237499 -0.235018 0.268697 0.251111 0.293029 0.265805 0.254557 0.262923 0.265718 0.287179 0.231688 0.235766 0.233772 0.229576 0.234935 0.231808
chargesum: 0.00000
title: Mulliken charges with hydrogens summed into heavy atoms:
elementType: S O O C C C C C C C C C C C C C C C
charge: 0.896621 -0.546896 -0.567891 0.458711 0.275154 0.277889 -0.390843 -0.158095 -0.095253 -0.116831 -0.117445 0.072933 0.008029 0.001157 0.012736 -0.004204 -0.002564 -0.003210
polarizability: 2.46859468e+02 3.07404638e+00 2.27803372e+02 1.04289631e+01 7.27933127e+00 1.27680645e+02
1716.lowfreq: -2.5505 -0.0017 -0.0013 -0.0003 4.5170 10.4676 34.9987 46.6296 62.9692
frequency: 34.9836 46.6100 62.9683 67.3523 74.6930 98.1732 143.8603 161.7349 185.0793 199.3819 216.1833 237.4368 252.2931 287.1026 321.2777 357.3703 371.3715 405.4380 410.1320 443.6160 465.3558 532.6438 565.4092 609.0700 614.6179 619.3207 644.3557 670.4771 700.8572 705.0490 714.0754 734.6940 778.9069 781.9119 786.1886 855.6115 862.9628 873.2730 904.7160 932.6152 944.7965 974.7910 981.2449 985.8604 988.9690 990.0110 997.0276 1000.8197 1007.2403 1027.3095 1031.5143 1085.2841 1094.1556 1155.2914 1175.1515 1176.4452 1193.2770 1207.0309 1222.4207 1296.6285 1309.7573 1321.4016 1343.4931 1375.7185 1379.7353 1409.4525 1425.4093 1432.5325 1436.9713 1477.6010 1485.8907 1562.0227 1580.6764 1589.0079 1606.5928 1610.4069 3028.7885 3121.6716 3127.5708 3129.1326 3134.5983 3140.8990 3145.9187 3153.7784 3155.5183 3158.3468 3167.3804 3169.1511 3179.3761 3180.7422
redmass: 4.7086 5.7939 5.0645 4.2539 4.7709 4.3093 5.7875 4.7329 1.1304 4.4681 4.3793 4.3662 4.6233 5.0591 8.4562 5.0066 7.4213 2.8683 2.8875 3.6750 4.3737 5.6331 7.1283 5.6226 6.2598 6.1322 2.6970 5.5935 1.9542 1.8381 1.4899 3.5175 7.8678 2.0780 2.2226 1.2459 1.2630 3.5622 3.6646 1.4517 1.4252 1.4215 1.4417 2.6201 5.1177 1.7181 1.8792 1.3246 1.3758 2.3319 2.0795 1.5978 1.6380 2.5070 1.0540 1.0570 1.1167 1.1333 1.6339 1.2729 1.6009 1.4487 1.5257 6.5048 6.7546 1.0531 1.0553 2.2723 2.3170 2.1868 2.2472 7.5000 5.6138 6.6913 6.0249 5.7927 1.0248 1.0910 1.0852 1.0863 1.0877 1.0911 1.0924 1.0959 1.0962 1.0927 1.1014 1.1015 1.1067 1.1080
irintensity: 3.1429 3.5240 0.3442 1.1913 0.5807 3.1074 3.5666 6.1903 0.6710 0.3475 0.0593 0.7094 1.6477 4.2633 19.1007 4.4660 62.0045 0.4167 0.0446 5.1525 2.9864 11.9116 67.0642 6.8996 1.3415 11.8093 4.0234 5.8068 24.4142 39.8810 89.0472 10.2895 59.1173 51.1123 35.0841 1.3471 4.9898 39.1095 9.1029 1.0229 6.9396 43.8324 0.9188 12.3545 1.1744 2.7961 43.3195 0.0887 2.0670 5.6520 6.8597 8.1146 6.2935 3.0002 0.0206 0.2375 3.3481 3.2739 17.0010 2.1805 18.2529 9.0446 16.3795 1.1930 0.8213 12.0935 13.1376 8.5427 11.5743 9.9328 8.9377 63.8844 1.7724 15.0175 4.7638 2.5237 1.4428 6.7782 2.3366 1.8582 0.5134 7.8551 15.4157 27.2907 22.8921 4.0602 32.2873 22.4725 1.0874 1.9670
temp: 298.150 k
press: 1.00000 atm
elementType: 16 8 8 6 6 6 6 6 6 6 6 6 6 6 6 6 6 6 1 1 1 1 1 1 1 1 1 1 1 1 1 1
symmnumber: 1
zpe: 643614.7 jmol-1
zpe.correction: 0.245140 hartree
zpe.thermalcorrener: 0.262158 hartree
zpe.thermalcorrenthalpy: 0.263102 hartree
zpe.thermalcorrgfe: 0.199485 hartree
zpe.sumelectzpe: -1127.037493 hartree
zpe.sumelectthermal: -1127.020476 hartree
zpe.sumelectthermalent: -1127.019531 hartree
zpe.sumelectthermalfe: -1127.083148 hartree
dipole: -5.2518 -2.0729 -0.4403
dipole: 5.6632
quadrupole: -114.8621 -87.6686 -120.8824
quadrupole: -1.9731 0.4628 4.8254
quadrupole: -7.0578 20.1358 -13.0780 -1.9731 0.4628 4.8254
hfenergy: -1127.2826332 hartree
pointgroup: C01 [X(C15H14O2S1)]
dipole: -2.1740739 0.1440541 0.4658158 debye
polarizability: 241.9064702|4.9870291|226.8831957|-26.6044291|9.5405508|133.5538199 unknown
InChI: InChI=1S/C15H14O2S/c1-18(16,17)12-15(13-8-4-2-5-9-13)14-10-6-3-7-11-14/h2-12H,1H3
charge 0 multiplicity 1
32 atoms
S  2.043411 2.261642 -0.166848
O  2.908243 1.57691 1.041356
O  2.630894 2.240982 -1.703687
C  -0.160452 0.375633 -0.065401
C  -1.635576 0.160137 0.105486
C  0.722623 -0.819292 -0.168373
C  0.258748 1.674871 -0.146809
C  -2.400084 0.989761 0.971344
C  1.821631 -0.85708 -1.07166
C  -2.299153 -0.870078 -0.616576
C  0.457772 -1.95945 0.641941
C  1.810781 4.113056 0.282696
C  -3.793036 0.804443 1.100949
C  2.638349 -2.004228 -1.146818
C  -3.693011 -1.0487 -0.491486
C  1.284237 -3.098512 0.570822
C  -4.445912 -0.212182 0.365986
C  2.378166 -3.125585 -0.326243
H  -0.422612 2.530433 -0.194504
H  -1.892409 1.754472 1.570185
H  2.0332 -0.000599 -1.722846
H  -1.720891 -1.517085 -1.284452
H  -0.384068 -1.940826 1.342594
H  1.204208 4.573232 -0.509671
H  1.3428 4.155752 1.275912
H  2.834677 4.511207 0.294709
H  -4.36587 1.44271 1.782585
H  3.480687 -2.018532 -1.846507
H  -4.191861 -1.838747 -1.063262
H  1.078695 -3.961168 1.213874
H  -5.527113 -0.357119 0.46697
H  3.019825 -4.011858 -0.385466
