program: Gaussian 09
title: 000191095
version: EM64L-G09RevD.01
frameworkgroup: C1[X(C20H20Br2O3)]
method: RPBEPBE
basis: SDD
operation: Freq
keyword: #p
keyword: freq=noraman
keyword: PBEPBE/SDD
title: #p freq=noraman PBEPBE/SDD
converged: YES YES NO NO
title: Mulliken charges:
elementType: Br Br O O O C C C C C C C C C C C C C C C C C C C C H H H H H H H H H H H H H H H H H H H H
charge: 0.081182 0.075534 -0.259640 -0.274256 -0.230262 0.314929 -0.277298 -0.378630 -0.735234 -0.727127 0.163552 0.287459 -0.607276 -0.494244 0.410763 -0.481069 -0.327108 0.293667 -0.643423 0.471948 -0.378063 -0.404022 -0.224569 -0.225791 -0.240217 0.283364 0.270777 0.263415 0.209660 0.216044 0.228708 0.209297 0.226382 0.228228 0.228273 0.245714 0.298649 0.273274 0.236541 0.239697 0.236136 0.235017 0.223495 0.227165 0.229360
chargesum: 0.00000
title: Mulliken charges with hydrogens summed into heavy atoms:
elementType: Br Br O O O C C C C C C C C C C C C C C C C C C C C
charge: 0.081182 0.075534 -0.259640 -0.274256 -0.230262 0.314929 0.006066 -0.107854 -0.046115 -0.062739 0.391780 0.287459 -0.607276 -0.020258 0.410763 -0.182420 -0.053834 0.293667 -0.167186 0.471948 -0.141927 -0.169005 -0.001075 0.001373 -0.010857
polarizability: 3.13679702e+02 -1.11892625e+01 2.54501179e+02 -9.62060167e+00 -1.72283865e+01 2.04113339e+02
1716.lowfreq: -3.6561 -1.5103 -0.0003 0.0006 0.0006 1.8487 4.9366 9.1267 15.2467
frequency: 3.4521 8.7918 15.0444 16.7807 21.5374 31.1773 46.3013 54.0978 73.7500 78.0657 119.9377 133.4641 135.8111 157.7862 171.4927 182.1550 195.0319 205.3545 230.7984 234.9601 252.4446 256.5460 296.3104 316.0253 322.0467 339.6443 356.7695 371.9114 403.0167 413.0749 420.1996 467.6688 473.5761 494.4666 544.7847 578.2769 596.2235 611.2573 618.5934 625.4434 672.1051 686.2356 697.4210 704.7048 726.6520 746.4746 762.1196 779.5693 809.8256 815.4494 831.5512 851.8031 853.6996 869.0344 897.5914 898.7402 921.7077 938.2749 941.6050 958.9103 969.6293 974.7357 982.1256 990.7401 994.8214 995.6487 1014.3271 1027.2667 1043.5512 1081.2806 1083.1512 1086.4713 1117.4983 1124.1606 1127.6844 1153.0523 1164.7499 1171.6202 1175.7743 1188.4161 1213.4148 1217.8547 1221.7104 1247.3390 1269.3929 1283.0659 1321.9131 1329.8407 1336.3727 1351.7650 1383.5779 1388.9531 1389.6741 1399.2750 1413.3297 1440.7053 1453.8868 1462.3220 1464.2640 1470.2726 1482.2716 1485.8729 1488.7903 1549.5459 1595.6814 1607.2306 1615.8983 1616.5320 1621.4112 2976.3993 2977.0484 2980.8959 3021.8487 3038.2340 3061.4966 3071.3813 3081.4730 3100.1763 3116.4548 3117.9192 3118.2055 3120.2512 3133.9564 3134.3548 3145.7487 3152.6647 3163.6936 3236.4019 3249.8734
redmass: 5.4036 7.4064 6.4781 5.3961 5.3033 6.8860 5.6918 5.3687 7.4867 5.3329 5.1421 5.7575 4.9206 1.6487 4.7723 2.6120 2.0227 2.0886 5.9792 3.8772 4.8038 3.0377 4.4892 2.3607 3.4974 4.8105 2.6484 2.7417 2.8087 3.6232 3.9530 3.5462 3.6405 4.1350 4.4989 4.6555 4.3126 3.8929 6.2513 4.4110 3.6306 4.1911 5.5462 1.7196 2.2688 5.8566 2.0105 2.5320 3.6969 3.9710 3.7130 1.2574 1.8399 1.3560 3.4347 3.3079 1.6117 1.8102 2.2972 1.4738 2.2708 1.3898 1.6173 5.9777 1.3625 2.4104 1.6205 2.2144 1.8623 1.4295 1.5845 3.9209 2.0461 2.2506 2.5558 3.4525 1.3380 1.1300 1.1292 1.1266 1.9866 1.6523 1.5032 1.3147 1.4587 1.8972 1.6016 1.4832 1.4956 1.4511 8.3640 1.2911 3.6210 1.4637 2.0026 2.1744 1.1237 1.0520 1.1286 1.0490 1.1045 2.3278 1.0630 6.2087 6.1249 7.0855 7.6759 6.7690 8.4643 1.0592 1.0370 1.0364 1.1003 1.0598 1.0990 1.0990 1.0989 1.0985 1.1061 1.0865 1.0891 1.0875 1.0885 1.0914 1.0961 1.0889 1.1016 1.0986 1.1007
irintensity: 0.0920 0.0476 0.1414 0.0309 0.1321 0.1715 0.3211 0.3873 0.0341 1.6600 0.9328 0.0510 1.3901 0.0926 1.3138 1.9376 0.2922 0.8251 0.8756 2.4337 8.1005 3.0336 11.8312 1.9465 6.6818 2.0970 7.7424 1.7366 0.0108 8.3035 15.4368 4.3232 3.6972 7.9890 13.8285 6.3902 3.6268 3.6723 0.0315 1.2267 7.7244 4.0906 45.4349 50.5513 83.0816 52.8302 88.0739 10.8358 93.8648 4.9683 37.6840 0.4346 22.6920 18.1977 8.5145 22.7700 9.8575 4.0514 26.6810 3.5433 14.9624 0.0621 32.6749 0.3391 0.7392 18.9362 4.7975 5.2931 40.2894 38.9778 10.9688 29.3222 294.4345 1.9057 62.6111 104.6874 19.8137 6.3155 4.9642 0.0981 3.2287 78.0666 9.6036 4.1445 33.0401 40.4956 0.7594 2.8740 34.8681 33.1909 0.0225 26.2090 11.0897 35.5711 46.9110 6.8557 25.4917 9.2737 20.3916 8.3842 7.9784 16.9946 14.9907 35.0129 0.8303 51.1819 19.8995 10.4070 70.2419 30.0298 26.4288 37.8435 8.8466 30.5405 18.0649 37.4257 32.3008 7.5413 7.8027 6.3310 6.5331 4.5543 3.7617 12.1518 42.8333 2.6386 19.1093 3.0698 0.1290
temp: 298.150 k
press: 1.00000 atm
elementType: 35 35 8 8 8 6 6 6 6 6 6 6 6 6 6 6 6 6 6 6 6 6 6 6 6 1 1 1 1 1 1 1 1 1 1 1 1 1 1 1 1 1 1 1 1
symmnumber: 1
zpe: 908114.5 jmol-1
zpe.correction: 0.345883 hartree
zpe.thermalcorrener: 0.371585 hartree
zpe.thermalcorrenthalpy: 0.372529 hartree
zpe.thermalcorrgfe: 0.280850 hartree
zpe.sumelectzpe: -1024.831622 hartree
zpe.sumelectthermal: -1024.805919 hartree
zpe.sumelectthermalent: -1024.804975 hartree
zpe.sumelectthermalfe: -1024.896654 hartree
dipole: 2.1147 -0.6022 1.9461
dipole: 2.9363
quadrupole: -174.4757 -154.9167 -158.5700
quadrupole: 3.9702 -8.4284 0.9633
quadrupole: -11.8216 7.7375 4.0841 3.9702 -8.4284 0.9633
hfenergy: -1025.1775045 hartree
pointgroup: C01 [X(C20H20Br2O3)]
dipole: 0.6805784 -0.2159032 -0.9081775 debye
polarizability: 310.330127|12.9687444|222.5350745|-11.65047|-32.3763864|239.4290177 unknown
InChI: InChI=1S/C20H20Br2O3/c1-20(2)16(10-17(21)22)18(20)19(23)25-12-14-9-15(24-11-14)8-13-6-4-3-5-7-13/h3-7,9-11,16,18H,8,12H2,1-2H3
charge 0 multiplicity 1
45 atoms
Br -7.690517 -0.309875 1.408768
Br -5.222421 -0.55102 3.558289
O  -1.098087 2.328201 -0.465566
O  -0.772448 0.941575 1.391343
O  3.226671 2.345533 -1.891906
C  -2.540609 -1.076434 -0.355187
C  -3.408911 -0.405275 0.731807
C  -2.552568 0.477651 -0.230893
C  -1.323222 -1.868808 0.116484
C  -3.201658 -1.648043 -1.609374
C  -4.884986 -0.345379 0.649797
C  -1.403494 1.226766 0.341085
C  -5.754898 -0.393477 1.690204
C  0.090194 3.15708 -0.030485
C  1.371267 2.616299 -0.583521
C  2.125475 1.473059 -0.090842
C  2.071799 3.11256 -1.670702
C  3.237493 1.328219 -0.898836
C  4.410474 0.387245 -0.943812
C  4.272205 -0.760537 0.049585
C  3.432117 -1.866251 -0.239573
C  4.962001 -0.734649 1.286626
C  3.286927 -2.923608 0.685615
C  4.819824 -1.790948 2.216027
C  3.981244 -2.888997 1.917904
H  -2.989768 -0.466546 1.742251
H  -3.076845 1.010273 -1.029121
H  -0.858947 -1.42081 1.010038
H  -0.5564 -1.91306 -0.680376
H  -1.623868 -2.905128 0.359001
H  -2.454276 -1.746076 -2.417846
H  -4.020872 -1.014819 -1.992562
H  -3.615447 -2.653087 -1.403823
H  -5.332271 -0.253624 -0.348969
H  -0.145359 4.15486 -0.43078
H  0.098024 3.171642 1.07305
H  1.85242 0.845648 0.754582
H  1.912549 3.941303 -2.355586
H  4.508755 -0.005414 -1.97533
H  5.339126 0.955891 -0.740384
H  2.891949 -1.896945 -1.194031
H  5.612818 0.115895 1.523711
H  2.637064 -3.773144 0.446395
H  5.361886 -1.756717 3.167714
H  3.870086 -3.708828 2.636324
