program: Gaussian 09
title: 000017556
version: EM64L-G09RevD.01
frameworkgroup: C1[X(C6H10Cl2O)]
method: RPBEPBE
basis: SDD
operation: Freq
keyword: #p
keyword: freq=noraman
keyword: PBEPBE/SDD
title: #p freq=noraman PBEPBE/SDD
converged: YES YES NO NO
title: Mulliken charges:
elementType: Cl Cl O C C C C C C H H H H H H H H H H
charge: 0.056149 0.011374 -0.150335 -0.505827 -0.329183 0.357335 -0.463991 -0.661448 -0.678724 0.232853 0.263894 0.257635 0.236300 0.243980 0.216911 0.226412 0.238872 0.231619 0.216176
chargesum: 0.00000
title: Mulliken charges with hydrogens summed into heavy atoms:
elementType: Cl Cl O C C C C C C
charge: 0.056149 0.011374 -0.150335 -0.505827 0.167564 0.357335 0.029944 0.025854 0.007942
polarizability: 9.04063584e+01 1.36281793e+00 8.41657045e+01 5.16034947e+00 4.76179028e+00 8.32074088e+01
1716.lowfreq: -11.1237 -3.0388 -0.0009 0.0009 0.0019 16.8557 43.9712 53.1649 116.9038
frequency: 43.7141 53.0773 116.8789 150.5528 162.8179 196.1092 204.0437 215.4049 240.1111 289.5134 309.3406 353.1989 375.0710 476.4098 541.3676 637.2560 698.7722 754.8063 807.9171 829.3530 932.3007 984.4027 1026.2811 1054.9834 1076.1575 1097.1867 1109.5327 1163.7284 1245.0531 1272.8787 1320.4089 1327.0392 1397.2461 1397.9901 1434.2625 1460.4744 1470.2835 1473.1655 1480.4874 1486.6785 1643.3354 2969.2084 2992.9666 3001.1633 3013.6228 3042.5929 3068.8296 3089.1177 3097.9666 3106.0036 3107.5545
redmass: 2.3758 4.8101 2.8880 2.5299 1.7445 1.3979 3.0022 2.1940 6.9147 6.0192 2.6675 5.8564 5.0510 3.6190 3.0364 3.5960 3.3338 2.5932 1.5317 1.5325 2.0305 2.6643 1.6657 2.3705 1.8749 2.4048 2.3667 2.5526 1.1834 1.1885 1.3815 1.6469 1.1926 1.1994 1.0858 1.0721 1.0397 1.0409 1.0480 1.0555 10.0841 1.0654 1.0366 1.0360 1.0615 1.0926 1.0999 1.0996 1.1006 1.1004 1.1001
irintensity: 0.1109 3.1209 0.0821 0.0394 1.3249 0.3292 0.5071 2.2151 0.8736 0.8802 3.8355 11.6518 8.8987 6.0796 3.3918 39.2496 67.5803 9.6822 18.5905 37.4907 16.6281 15.7163 7.3817 4.6672 14.4726 18.6044 13.4637 4.9670 0.6762 5.4167 1.8207 20.7564 17.4203 15.9981 26.9188 5.7213 12.5354 14.0844 12.7362 9.1381 76.5055 18.9316 20.7260 25.2734 8.3404 2.9047 1.8181 36.6056 24.2276 18.2125 21.6558
temp: 298.150 k
press: 1.00000 atm
elementType: 17 17 8 6 6 6 6 6 6 1 1 1 1 1 1 1 1 1 1
symmnumber: 1
zpe: 387581.8 jmol-1
zpe.correction: 0.147622 hartree
zpe.thermalcorrener: 0.159065 hartree
zpe.thermalcorrenthalpy: 0.160009 hartree
zpe.thermalcorrgfe: 0.109499 hartree
zpe.sumelectzpe: -1229.250005 hartree
zpe.sumelectthermal: -1229.238562 hartree
zpe.sumelectthermalent: -1229.237617 hartree
zpe.sumelectthermalfe: -1229.288128 hartree
dipole: -1.1710 1.9046 -3.7020
dipole: 4.3247
quadrupole: -66.0100 -68.1952 -72.3723
quadrupole: 2.1415 1.2683 -2.7268
quadrupole: 2.8492 0.6639 -3.5131 2.1415 1.2683 -2.7268
hfenergy: -1229.3976267 hartree
pointgroup: C01 [X(C6H10Cl2O1)]
dipole: 0.1583686 1.2354596 1.1591338 debye
dipolederiv: -0.3855263 -0.0646522 -0.2715305 -0.0922742 -0.2078183 -0.1141982 -0.2730722 -0.0919106 -0.4431364 -0.2690402 0.0311571 -0.0255719 0.0621489 -0.5248806 0.2801587 -0.0423566 0.2705868 -0.4306001 -0.5412915 -0.0671255 0.1342741 -0.0414816 -0.2446035 -0.0922069 0.1351664 -0.0635204 -0.6906049 0.3669808 -0.1054571 0.4143144 -0.0835125 0.7423593 -0.1311189 0.458913 -0.0814312 0.8603634 -0.0385353 -0.0235195 0.0069364 0.013075 -0.0738525 0.011609 0.0012253 0.016107 -0.0834921 0.8611711 0.3208131 -0.1370795 0.2411099 0.1052418 0.1550625 -0.2324545 0.1100224 0.6711852 -0.1730762 -0.1203006 -0.0896104 -0.1575789 0.0394044 -0.1464706 -0.07604 -0.1014875 -0.1389014 0.0683461 0.0465135 -0.0268394 0.0317979 -0.0420096 0.0519554 0.0039134 -0.0631214 0.0315413 -0.0099383 0.0019151 0.0303532 -0.000158 0.0676344 0.0134814 -0.0235092 -0.0203154 0.0471758 0.041116 0.0137453 -0.1049388 -0.0160791 0.013441 -0.0277237 -0.1181167 -0.0161964 -0.0395786 -0.0558103 -0.0307747 0.0688872 -0.0313831 0.0363872 0.031606 0.0554244 0.0266775 0.0744755 0.0560442 -0.042121 0.0498098 -0.002537 0.0717877 0.0948945 0.0686357 0.0507462 -0.0187035 0.0293919 0.0752158 -0.0084445 0.0969312 -0.0702838 -0.0402536 0.0226656 -0.0151646 0.0857179 0.0245166 -0.0021016 -0.086457 -0.0542325 0.1040446 -0.0403771 -0.0998871 0.0217877 -0.0222051 -0.1107575 -0.0896928 0.0734399 -0.0521965 0.0699124 0.031159 0.0665771 0.0361924 0.0536761 0.0629793 0.0853016 0.0501587 0.0859646 -0.0798331 -0.0695687 0.063902 -0.0856124 0.0155603 0.0811904 0.0078872 -0.0010252 -0.0098056 0.0449149 0.0873019 0.0718759 0.1049108 -0.0490543 0.048924 0.024887 0.0097087 0.0855117 -0.1126313 -0.0213131 0.0365684 -0.0228689 0.0944422 -0.0566847 -0.0616907 -0.0863852 -0.0753002 0.060785 -0.0739977 -0.119431 -0.0754019 -0.0178614 unknown
polarizability: 88.8533721|2.0698342|81.489965|6.1521932|-3.0074435|87.4361346 unknown
InChI: InChI=1S/C6H10Cl2O/c1-3-5(9)6(7,8)4-2/h3-4H2,1-2H3
charge 0 multiplicity 1
19 atoms
Cl -1.893392 -0.903932 -1.325119
Cl -0.653828 -1.866325 1.28561
O  0.985969 -0.319774 -1.613423
C  -0.791999 -0.377249 0.084344
C  -1.43749 0.787879 0.848673
C  0.665018 -0.122784 -0.422205
C  1.649543 0.410965 0.62276
C  -1.590613 2.070284 -0.000661
C  3.113225 0.324993 0.153377
H  -0.819853 0.99001 1.743707
H  -2.424423 0.449678 1.210758
H  1.499419 -0.126681 1.577031
H  1.375045 1.469087 0.821397
H  -2.250263 1.894794 -0.866748
H  -0.620015 2.438091 -0.381018
H  -2.03589 2.86916 0.617758
H  3.254118 0.859271 -0.800819
H  3.412915 -0.724651 -0.008771
H  3.785015 0.766284 0.91035
