program: Gaussian 09
title: 000191086
version: EM64L-G09RevD.01
frameworkgroup: C1[X(C15H17N)]
method: RPBEPBE
basis: SDD
operation: Freq
keyword: #pfreq=noraman
keyword: PBEPBE/SDD
title: #p freq=noraman PBEPBE/SDD
converged: YES YES NO NO
title: Mulliken charges:
elementType: N C C C C C C C C C C C C C C C H H H H H H H H H H H H H H H H H
charge: -0.632902 -0.211065 -0.605272 0.510971 0.468802 -0.392220 -0.421246 -0.437871 -0.394511 0.435565 -0.392018 -0.391966 -0.226738 -0.232437 -0.244415 -0.808243 0.217676 0.196872 0.238310 0.241683 0.225830 0.275808 0.265459 0.236727 0.276005 0.227084 0.224810 0.223027 0.221439 0.224828 0.222648 0.224233 0.233128
chargesum: 0.00000
title: Mulliken charges with hydrogens summed into heavy atoms:
elementType: N C C C C C C C C C C C C C C C
charge: -0.091635 0.006611 -0.170091 0.510971 0.468802 -0.150537 -0.195415 -0.201144 -0.118506 0.435565 -0.164935 -0.167157 -0.003711 -0.010998 -0.019587 -0.128234
polarizability: 1.84310073e+02 -4.96178184e+00 1.75571644e+02 -2.98164273e+01 -5.21047634e+00 1.19276754e+02
1716.lowfreq: -25.4805 -12.3316 -5.5892 -0.0005 -0.0004 -0.0002 6.4985 25.6146 32.4341
frequency: -25.3615 25.5422 32.1475 38.7200 75.8382 106.8174 168.7823 216.4668 245.3151 275.0541 299.9076 328.9239 367.8686 377.5940 406.0616 406.9694 424.0126 501.5905 524.0951 555.6325 563.5123 615.7107 634.9572 639.8784 707.9390 719.2475 751.8055 759.9537 773.0628 814.6443 841.1305 849.4553 859.1758 916.1973 926.7928 950.1517 971.3347 974.2356 982.5560 989.9169 992.7699 997.9231 1013.9816 1023.9886 1046.4773 1065.7582 1090.4152 1112.6235 1139.2965 1169.5349 1181.3401 1183.1895 1192.2406 1214.5603 1219.5055 1223.8264 1276.4275 1311.4566 1316.9318 1321.6508 1362.0591 1376.6509 1391.4485 1395.5391 1406.6067 1442.0467 1463.9622 1472.2697 1473.5386 1481.3543 1509.3118 1583.2924 1593.7742 1612.1754 1626.1141 1636.7133 2872.9375 2972.6434 2973.8096 3052.8277 3053.4890 3082.5262 3104.6519 3114.3718 3116.4022 3122.9423 3129.7066 3136.3732 3140.6294 3148.0391 3160.7347 3455.9761 3587.5799
redmass: 1.0211 4.2878 3.6905 3.9082 3.9323 3.9620 3.9466 3.8994 2.3091 2.3211 2.5772 1.6670 3.2280 2.4086 2.8411 2.8174 4.3801 2.9845 3.5817 1.9329 2.6433 6.1881 2.4071 5.2148 1.7589 3.2670 3.5775 2.6248 1.9341 2.0273 2.9745 1.2558 1.2513 1.8992 1.4948 1.3934 1.4925 1.7479 1.3962 3.7528 1.7942 1.3549 2.8992 2.2678 1.5572 2.0114 2.1705 1.3630 1.3129 1.0567 1.1104 1.4098 1.1015 1.8489 4.2572 1.9929 1.3433 1.3076 1.3430 1.2996 2.3051 4.5562 3.6122 1.2255 2.7541 2.1191 1.1161 1.0916 1.0573 2.2943 2.7653 5.9823 6.0597 5.4972 6.4500 1.1252 1.0826 1.0392 1.0632 1.0979 1.0948 1.0997 1.0868 1.0874 1.0850 1.0876 1.0962 1.0922 1.0971 1.0953 1.1013 1.0447 1.0982
irintensity: 0.5540 0.0255 0.2959 0.0282 1.1563 1.8615 0.0218 2.9405 11.3183 7.3230 0.4107 41.7784 0.2419 0.1725 0.0497 0.3431 4.2478 15.9267 4.1917 74.9373 64.4372 1.1442 70.7999 13.1647 57.3818 3.6470 2.0560 13.6639 27.7439 31.4274 19.8008 0.3679 0.2955 0.8998 7.5942 2.2288 0.4422 2.2969 0.2194 0.0664 0.8651 1.2784 3.4630 9.6431 14.8944 14.3853 6.5720 6.4448 15.5095 0.2312 0.7010 10.3958 0.9037 0.9779 2.1316 0.3895 4.1995 2.0302 6.6325 9.8733 7.6911 2.6683 5.9033 9.9556 2.0266 12.9248 5.5695 14.1892 13.1091 12.6412 33.4630 0.0497 0.3232 5.3095 1.4309 57.5974 63.4499 49.5491 39.5855 19.5606 25.6751 19.1597 13.6849 16.8731 4.6382 2.3656 43.3218 26.0008 6.9942 25.8938 23.6926 1.0459 0.2028
temp: 298.150 k
press: 1.00000 atm
elementType: 7 6 6 6 6 6 6 6 6 6 6 6 6 6 6 6 1 1 1 1 1 1 1 1 1 1 1 1 1 1 1 1 1
symmnumber: 1
zpe: 728318.8 jmol-1
zpe.correction: 0.277402 hartree
zpe.thermalcorrener: 0.291634 hartree
zpe.thermalcorrenthalpy: 0.292578 hartree
zpe.thermalcorrgfe: 0.234564 hartree
zpe.sumelectzpe: -635.394525 hartree
zpe.sumelectthermal: -635.380293 hartree
zpe.sumelectthermalent: -635.379349 hartree
zpe.sumelectthermalfe: -635.437363 hartree
dipole: 0.4019 0.4408 -1.0873
dipole: 1.2402
quadrupole: -91.8686 -84.4370 -94.7376
quadrupole: -2.4086 -3.3890 -4.4325
quadrupole: -1.5209 5.9108 -4.3899 -2.4086 -3.3890 -4.4325
hfenergy: -635.6719273 hartree
pointgroup: C01 [X(C15H17N1)]
dipole: -0.1614764 -0.1541576 -0.4338506 debye
polarizability: 183.7953779|-6.2431843|175.5057833|29.9973114|6.2328526|119.8573101 unknown
InChI: InChI=1S/C15H17N/c1-12-7-9-13(10-8-12)11-15(16)14-5-3-2-4-6-14/h2-10,15H,11,16H2,1H3
charge 0 multiplicity 1
33 atoms
N  2.241036 -2.721135 -0.359324
C  1.220676 -1.66181 -0.506067
C  0.111497 -1.916042 0.574108
C  -1.116489 -1.037964 0.406325
C  1.873872 -0.28825 -0.339293
C  -1.239715 0.197836 1.090092
C  -2.170249 -1.422696 -0.462058
C  1.481874 0.803813 -1.150812
C  2.864381 -0.082802 0.655488
C  -3.428241 0.635519 0.041872
C  -2.375692 1.017644 0.912921
C  -3.305783 -0.602113 -0.640764
C  2.063427 2.080363 -0.97278
C  3.44849 1.190335 0.834382
C  3.049502 2.278039 0.021022
C  -4.637908 1.531205 -0.168278
H  0.710661 -1.678072 -1.500133
H  -0.182977 -2.983122 0.498462
H  0.575889 -1.775846 1.566966
H  -0.437111 0.519428 1.764572
H  -2.107091 -2.381916 -0.992574
H  3.056699 -2.60789 -0.968654
H  1.865472 -3.674109 -0.374312
H  0.71325 0.655396 -1.919266
H  3.175268 -0.937503 1.266491
H  -2.447983 1.966234 1.459618
H  -4.111084 -0.927686 -1.3114
H  1.749034 2.916466 -1.607959
H  4.215578 1.336207 1.604074
H  3.504261 3.265931 0.158113
H  -5.53655 0.94429 -0.428937
H  -4.866504 2.121836 0.736643
H  -4.464193 2.249714 -0.993241
