program: Gaussian 09
title: 000191079
version: EM64L-G09RevD.01
frameworkgroup: C1[X(C16H10O)]
method: RPBEPBE
basis: SDD
operation: Freq
keyword: #pfreq=noraman
keyword: PBEPBE/SDD
title: #p freq=noraman PBEPBE/SDD
converged: NO YES NO YES
title: Mulliken charges:
elementType: O C C C C C C C C C C C C C C C C H H H H H H H H H H
charge: -0.183462 -0.133000 0.365683 0.213407 0.345378 -0.647510 0.243048 -0.036976 0.450732 -0.679722 -0.429958 -0.408666 -0.229830 -0.376415 -0.452901 -0.245831 -0.243373 0.260470 0.260558 0.274420 0.248684 0.229820 0.224765 0.232619 0.251845 0.232144 0.234072
chargesum: 0.00000
title: Mulliken charges with hydrogens summed into heavy atoms:
elementType: O C C C C C C C C C C C C C C C C
charge: -0.183462 -0.133000 0.365683 0.213407 0.345378 -0.126482 0.243048 -0.036976 0.450732 -0.405302 -0.181274 -0.178846 -0.005065 -0.143795 -0.201056 -0.013687 -0.009301
polarizability: 2.81885111e+02 -8.09133926e+00 2.04522359e+02 -1.40935258e-02 -1.08327165e-02 6.86579460e+01
1716.lowfreq: -6.8775 -5.9926 -0.0008 -0.0006 0.0005 5.7956 90.0929 94.4119 112.2351
frequency: 90.0894 94.4112 112.2340 206.7888 216.0321 240.2488 272.7416 291.1015 392.7312 416.0534 417.7199 461.4203 492.2988 498.8305 523.7082 537.7914 582.7251 588.3532 620.5186 630.5137 641.6245 684.7392 759.1180 767.6821 777.3789 779.7684 835.6029 837.4974 878.5841 889.8973 907.1399 930.8420 950.2755 956.7513 973.0987 981.8644 995.9135 1033.4565 1044.6441 1060.8505 1099.1664 1126.2564 1139.4466 1177.0166 1183.2183 1198.2692 1204.9291 1243.8536 1262.9278 1287.0246 1321.1177 1366.3410 1389.1926 1406.1274 1420.2414 1432.9702 1454.8299 1467.9952 1492.5678 1532.1422 1599.8447 1610.2917 1616.8025 1621.4236 1643.5451 3000.9877 3051.7777 3125.9599 3127.1740 3134.8454 3140.2882 3142.3097 3150.5074 3159.5280 3166.5284
redmass: 5.0672 3.9795 4.5232 6.7746 2.6127 3.8822 4.6156 6.3173 6.2849 3.5215 6.3140 3.3044 3.1923 7.9298 2.6624 5.8526 5.4245 3.4261 6.1332 5.7049 2.8905 5.6502 2.6505 1.4485 5.1139 1.4364 5.4676 2.3346 1.4397 5.4316 1.7530 1.7163 5.5412 1.8531 1.5674 1.4027 1.3646 2.3875 3.2348 2.4770 4.3314 1.1877 1.8888 1.0892 1.3683 1.3616 1.3203 2.1990 2.3482 2.0601 2.3273 3.1813 4.6172 2.4820 1.3666 2.5862 2.8135 3.3424 4.3307 4.6053 7.9835 7.6409 7.6415 7.3152 10.5205 1.0609 1.0997 1.0859 1.0863 1.0889 1.0923 1.0921 1.0943 1.0981 1.1003
irintensity: 0.0662 6.0195 0.0006 1.1959 3.1299 4.8316 5.0394 1.2255 0.7584 2.5383 0.5197 0.1368 1.1734 7.2980 6.3134 11.0688 2.9061 1.0268 12.2673 0.1725 0.1395 1.5602 34.0646 59.7972 0.9415 44.2241 1.3953 0.0961 9.0494 4.1855 0.2875 27.6283 3.9332 1.4155 6.7936 3.1872 0.2991 4.8525 7.8448 8.3109 71.7175 0.1425 8.4149 0.6491 21.5054 16.1932 5.7083 15.9790 4.0710 20.3379 3.4953 4.6505 1.5489 5.9733 19.1019 11.7430 20.5770 20.6774 9.6790 22.3857 8.7993 146.6499 61.1947 20.0515 132.9111 10.4675 3.7765 2.7247 0.3822 5.3113 2.3256 12.9477 13.5698 41.4791 35.1927
temp: 298.150 k
press: 1.00000 atm
elementType: 8 6 6 6 6 6 6 6 6 6 6 6 6 6 6 6 6 1 1 1 1 1 1 1 1 1 1
symmnumber: 1
zpe: 543526.2 jmol-1
zpe.correction: 0.207018 hartree
zpe.thermalcorrener: 0.218698 hartree
zpe.thermalcorrenthalpy: 0.219642 hartree
zpe.thermalcorrgfe: 0.169413 hartree
zpe.sumelectzpe: -689.833814 hartree
zpe.sumelectthermal: -689.822134 hartree
zpe.sumelectthermalent: -689.821190 hartree
zpe.sumelectthermalfe: -689.871419 hartree
dipole: 2.0028 3.4125 0.0001
dipole: 3.9568
quadrupole: -83.3162 -97.4157 -102.0963
quadrupole: -11.2838 -0.0020 -0.0036
quadrupole: 10.9599 -3.1396 -7.8202 -11.2838 -0.0020 -0.0036
hfenergy: -690.0408318 hartree
pointgroup: C01 [X(C16H10O1)]
dipole: 0.7433468 1.3677826 0.0000272 debye
polarizability: 282.3336369|-5.5289611|204.0738331|-0.0137294|-0.0112907|68.657946 unknown
InChI: InChI=1S/C16H10O/c17-15-9-11-5-3-7-13-12-6-2-1-4-10(12)8-14(15)16(11)13/h1-8H,9H2
charge 0 multiplicity 1
27 atoms
O  -2.507364 -3.089336 0.000181
C  -1.020183 0.180075 0.000391
C  -2.39253 0.56207 0.000309
C  -0.858402 -1.24752 0.000584
C  0.065883 1.094265 0.000168
C  -3.252696 -0.692892 0.000364
C  1.41162 0.516752 0.0001
C  -2.22058 -1.863837 0.001054
C  1.563129 -0.930541 0.000202
C  0.409611 -1.806108 0.000421
C  -2.706002 1.924707 0.000063
C  -0.280724 2.482145 -0.000015
C  -1.632795 2.874081 -0.000055
C  2.590571 1.32001 -0.000121
C  2.880273 -1.49206 0.000109
C  3.867887 0.741485 -0.000214
C  4.016556 -0.675865 -0.000098
H  -3.908527 -0.777721 0.887481
H  -3.908045 -0.778159 -0.887071
H  0.552247 -2.892761 0.000573
H  -3.743583 2.276181 -0.000046
H  0.495307 3.254695 -0.000171
H  -1.875435 3.942869 -0.000237
H  2.499022 2.411026 -0.000218
H  2.98472 -2.583338 0.000199
H  4.757364 1.381028 -0.000379
H  5.017476 -1.120152 -0.000173
