program: Gaussian 09
title: 000191065
version: EM64L-G09RevD.01
frameworkgroup: C1[X(C22H34N2O2)]
method: RPBEPBE
basis: SDD
operation: Freq
keyword: #p
keyword: freq=noraman
keyword: PBEPBE/SDD
title: #p freq=noraman PBEPBE/SDD
converged: YES YES NO NO
title: Mulliken charges:
elementType: O O N N C C C C C C C C C C C C C C C C C C C C C C H H H H H H H H H H H H H H H H H H H H H H H H H H H H H H H H H H
charge: -0.419773 -0.353383 -0.100691 -0.115143 -0.358378 -0.356414 -0.370208 -0.359391 -0.397358 -0.392446 -0.398988 -0.391597 -0.398518 -0.398479 -0.543419 -0.468129 0.529185 0.291924 -0.569460 -0.473366 0.506859 -0.063847 -0.245480 -0.138900 -0.705154 -0.706779 0.227458 0.179643 0.169675 0.209927 0.187305 0.227299 0.211887 0.171984 0.195586 0.204374 0.203237 0.193203 0.195330 0.200660 0.200978 0.193321 0.189710 0.216308 0.214505 0.191622 0.206335 0.221792 0.235826 0.241403 0.281158 0.254032 0.279065 0.209665 0.229724 0.215554 0.229577 0.210657 0.215566 0.382970
chargesum: 0.00000
title: Mulliken charges with hydrogens summed into heavy atoms:
elementType: O O N N C C C C C C C C C C C C C C C C C C C C C C
charge: -0.036803 -0.353383 -0.100691 -0.115143 0.048722 0.023188 0.044395 0.024480 0.002602 0.003994 -0.002998 0.002702 0.007499 0.007648 -0.115292 0.009101 0.529185 0.291924 -0.288302 -0.219334 0.506859 -0.063847 0.033585 -0.138900 -0.050210 -0.050980
polarizability: 3.21626159e+02 5.28345982e+00 2.98132216e+02 1.70880313e+01 -1.09860264e+01 1.98068958e+02
1716.lowfreq: -16.4843 -5.8643 -0.0004 0.0005 0.0007 3.0368 7.2276 18.9052 23.9810
frequency: -14.2231 18.5595 23.8780 33.1057 39.0245 42.9634 49.5256 67.3169 116.7475 122.1828 134.1201 140.5738 179.9424 193.4771 194.8962 219.4346 226.8443 239.2132 247.0042 250.7339 260.7141 282.9060 296.5164 301.0930 311.3309 332.6269 356.2614 377.0997 385.8177 388.1176 402.5414 416.4025 443.3937 448.4148 448.6946 454.7999 485.9612 490.3487 544.0912 555.8686 576.7254 598.3025 633.3704 657.1454 678.8545 752.5765 761.8052 763.3959 777.2561 802.1845 802.8848 841.6559 850.2313 852.2943 854.2017 856.1760 891.2471 896.7217 901.8799 925.3631 926.7804 944.7043 946.2921 954.8850 956.0293 957.2878 973.6539 989.5071 998.0895 1003.7128 1012.3389 1022.4218 1047.3326 1051.1321 1081.7779 1082.6871 1093.6443 1109.2472 1111.6750 1114.0458 1121.6163 1122.4475 1149.4082 1149.9209 1155.6364 1157.0939 1159.2967 1186.5568 1191.8477 1193.1388 1194.0927 1234.3306 1252.5459 1255.5411 1261.7411 1264.1280 1264.9225 1274.6151 1283.9659 1292.8461 1294.5537 1302.8369 1324.0775 1328.9045 1334.0244 1336.4378 1339.6249 1339.6396 1342.0027 1348.4475 1349.0211 1353.6578 1362.7715 1365.2218 1375.0338 1379.5740 1386.2806 1393.5688 1403.5774 1410.0417 1449.9222 1449.9641 1452.6848 1456.3496 1459.5865 1460.8523 1465.8173 1467.3778 1467.6367 1469.2841 1469.6764 1469.9494 1478.9729 1479.9680 1480.6125 1485.2322 1510.2989 1535.2456 1597.9011 1616.3859 2825.9887 2834.2132 2835.5227 2844.4395 2865.2528 2868.7290 2911.6607 2967.6021 2969.5070 2969.9841 2973.0177 2977.4548 2982.5894 2983.4051 2984.3290 2984.7801 2998.1494 3017.9646 3023.7352 3028.7676 3029.8141 3033.0374 3036.3059 3037.8802 3044.4359 3044.6420 3053.6599 3053.7441 3061.7490 3069.9538 3073.1545 3075.3589 3079.7142 3086.6283
redmass: 3.3266 3.7602 2.6578 3.6466 3.4776 3.9945 3.5268 3.8587 4.1687 4.6929 3.6194 3.2510 3.9015 3.6353 2.7633 1.0757 2.1135 1.8999 1.0798 3.7469 2.4666 2.9691 3.6268 2.0724 1.9536 2.7770 4.3092 2.4231 2.3583 2.2742 4.9461 3.1825 2.9799 3.0477 2.9581 3.2943 3.9127 3.7933 2.3359 2.0709 2.8411 3.3791 4.5755 3.7603 4.5174 4.6984 4.3104 7.1236 4.0343 1.4905 1.5016 3.3449 2.5839 1.8588 1.6156 1.7193 1.9572 1.1527 2.2960 1.2622 2.3890 3.0523 1.7416 1.3409 1.3144 1.3827 1.8291 2.4259 2.2684 1.7595 1.7499 2.6989 2.1049 2.0754 1.3994 1.3921 1.8228 2.4126 2.8235 2.3808 2.6822 2.6502 1.3436 1.3318 2.1278 2.3733 2.3334 1.7074 2.1890 1.5434 1.4698 2.5198 1.5138 1.5681 1.5655 1.2266 1.2185 1.3294 1.5156 1.3952 1.4249 1.7852 1.3306 1.3462 1.3755 1.5198 1.4280 1.4216 1.2668 1.4988 1.5530 1.9998 1.4364 1.4434 1.1900 1.5325 1.4368 1.2350 1.5778 1.9565 1.0917 1.0917 1.1047 1.0859 1.0876 1.0875 1.0658 1.0800 1.0753 1.0972 1.0695 1.0632 1.0942 1.0544 1.0961 1.0638 4.0577 6.9840 4.7457 6.3413 1.0712 1.0712 1.0703 1.0702 1.0690 1.0606 1.0676 1.0631 1.0623 1.0350 1.0354 1.0876 1.0618 1.0617 1.0616 1.0615 1.0900 1.0872 1.0876 1.0900 1.0858 1.0917 1.0942 1.0917 1.1029 1.1030 1.1038 1.1038 1.0997 1.0873 1.0974 1.1003 1.0990 1.0865
irintensity: 0.1226 0.0797 0.0198 0.1412 1.3921 0.4740 0.2847 0.7787 1.0219 0.5971 0.0521 1.9131 0.2348 1.1501 0.3653 0.0200 1.3001 0.8450 0.0269 2.1521 0.4542 0.6515 0.3337 5.0184 5.6036 1.2135 0.8089 9.3211 13.6932 0.5202 6.3146 8.6626 0.7660 1.8503 0.2544 3.0476 2.2584 12.0989 0.9362 1.8596 0.5031 3.9358 8.8224 8.3779 0.6130 20.8492 4.9827 0.9672 3.9514 0.0723 0.2809 9.5018 2.9635 5.7805 6.5457 10.0746 36.2467 79.3778 4.0813 3.4416 17.6741 3.6767 41.6357 4.2531 2.9200 2.9105 10.9542 12.7702 10.9022 6.9486 31.8887 30.0749 8.5756 0.9795 2.2443 5.3307 17.3567 33.5902 3.4129 35.3876 3.1045 4.3379 0.2790 8.4187 12.5748 28.2762 32.6056 5.6402 9.7652 2.5065 3.5871 213.1536 18.8686 33.1387 1.4937 1.9912 1.4802 15.9691 26.4555 9.4224 6.6542 27.9383 54.3175 60.6565 11.9846 79.2223 1.1415 1.2766 0.1454 7.2453 45.7042 181.5246 2.7222 9.7140 14.0676 29.8057 1.3313 30.0230 60.3845 47.7275 12.0497 3.4255 7.9889 5.2221 14.8150 15.0173 2.6179 6.2635 6.4223 10.5176 13.2383 2.4057 6.0106 13.9267 9.8425 18.7191 54.1553 20.9926 6.0768 2.3725 52.1372 54.0494 119.9493 155.2959 130.6810 115.8304 31.3972 42.2009 43.6189 28.2906 36.9615 19.7069 26.7767 23.9369 29.9123 31.8772 8.5695 58.8328 67.0235 64.7085 4.8036 72.5449 33.9350 23.2437 25.1695 22.6888 79.7165 118.2957 2.2260 12.1714 95.3327 25.5575 28.9485 5.8993
temp: 298.150 k
press: 1.00000 atm
elementType: 8 8 7 7 6 6 6 6 6 6 6 6 6 6 6 6 6 6 6 6 6 6 6 6 6 6 1 1 1 1 1 1 1 1 1 1 1 1 1 1 1 1 1 1 1 1 1 1 1 1 1 1 1 1 1 1 1 1 1 1
symmnumber: 1
zpe: 1370680.8 jmol-1
zpe.correction: 0.522065 hartree
zpe.thermalcorrener: 0.547377 hartree
zpe.thermalcorrenthalpy: 0.548321 hartree
zpe.thermalcorrgfe: 0.465604 hartree
zpe.sumelectzpe: -1116.644079 hartree
zpe.sumelectthermal: -1116.618767 hartree
zpe.sumelectthermalent: -1116.617823 hartree
zpe.sumelectthermalfe: -1116.700540 hartree
dipole: -0.1197 -5.0354 0.7060
dipole: 5.0860
quadrupole: -145.4580 -171.7509 -156.6438
quadrupole: -0.0205 0.0945 1.7129
quadrupole: 12.4929 -13.8000 1.3071 -0.0205 0.0945 1.7129
hfenergy: -1117.1661439 hartree
pointgroup: C01 [X(C22H34N2O2)]
dipole: 0.1677211 -1.9892723 0.1365491 debye
polarizability: 316.9667218|6.412794|300.394436|27.0582096|-0.6264988|200.4661755 unknown
InChI: InChI=1S/C22H34N2O2/c1-17(2)20-14-18(15-23-9-5-3-6-10-23)13-19(21(25)22(20)26)16-24-11-7-4-8-12-24/h13-14,17,25H,3-12,15-16H2,1-2H3
charge 0 multiplicity 1
60 atoms
O  -2.303115 3.298488 -0.591997
O  -0.204738 4.364891 0.139518
N  2.499013 -1.594728 0.485172
N  -3.58874 -0.665472 -0.461616
C  2.725016 -1.625646 -0.983535
C  3.178096 -2.720912 1.174292
C  -4.027743 -0.78434 0.95455
C  -4.633078 -1.149683 -1.40097
C  4.229643 -1.566199 -1.311904
C  4.697207 -2.695126 0.908423
C  -4.366956 -2.245487 1.310775
C  -4.989067 -2.623128 -1.11752
C  4.988891 -2.714755 -0.609565
C  -5.439786 -2.807682 0.349951
C  1.06705 -1.485691 0.83907
C  -3.122736 0.700589 -0.784415
C  0.462918 -0.106405 0.521948
C  -1.707304 1.009978 -0.269197
C  -0.858115 -0.08471 0.050891
C  1.299148 1.017735 0.794196
C  1.096966 2.398608 0.679007
C  -1.358301 2.367982 -0.202496
C  2.257244 3.331423 1.060319
C  -0.111983 3.056605 0.2213
C  2.632191 3.190754 2.559877
C  3.493657 3.098827 0.15098
H  2.199729 -0.764531 -1.435034
H  2.284942 -2.555799 -1.432088
H  2.766482 -3.709665 0.83758
H  2.979575 -2.635403 2.259732
H  -4.924619 -0.13784 1.144298
H  -3.215333 -0.409745 1.604305
H  -4.249365 -1.042308 -2.432952
H  -5.565098 -0.529538 -1.32493
H  4.368123 -1.618957 -2.408782
H  4.6308 -0.591562 -0.971095
H  5.120784 -1.774153 1.354223
H  5.172388 -3.560269 1.409615
H  -4.71619 -2.296027 2.359947
H  -3.445814 -2.8561 1.235077
H  -4.095902 -3.248716 -1.311132
H  -5.784774 -2.948993 -1.814762
H  4.659212 -3.68595 -1.034201
H  6.076376 -2.633824 -0.79582
H  -5.632484 -3.875887 0.564383
H  -6.395894 -2.267931 0.512006
H  0.445923 -2.274224 0.345519
H  0.989222 -1.663829 1.931908
H  -3.118163 0.817349 -1.886955
H  -3.815479 1.487167 -0.405591
H  -1.352401 -1.055476 -0.110312
H  2.30004 0.713464 1.13592
H  1.897965 4.361974 0.892953
H  3.005768 2.175868 2.793707
H  1.761247 3.393412 3.208801
H  3.428865 3.912126 2.820317
H  3.237921 3.24777 -0.91358
H  3.898685 2.075302 0.266814
H  4.296739 3.812159 0.413766
H  -1.800849 4.192117 -0.437989
