program: Gaussian 09
title: 000191061
version: EM64L-G09RevD.01
frameworkgroup: C1[X(C15H18N2O2)]
method: RPBEPBE
basis: SDD
operation: Freq
keyword: #p
keyword: freq=noraman
keyword: PBEPBE/SDD
title: #p freq=noraman PBEPBE/SDD
converged: YES YES NO NO
title: Mulliken charges:
elementType: O O N N C C C C C C C C C C C C C C C H H H H H H H H H H H H H H H H H H
charge: -0.417960 -0.230236 -0.280549 -0.407738 -0.354556 -0.381570 -0.414142 0.475448 0.419314 -0.471706 0.386790 -0.650551 -0.378656 -0.440985 -0.426859 -0.414324 -0.242207 -0.255673 0.180164 0.176964 0.206755 0.236337 0.217237 0.196462 0.233575 0.266413 0.297178 0.244933 0.251256 0.226606 0.226878 0.231323 0.233131 0.235954 0.223106 0.224647 0.377240
chargesum: 0.00000
title: Mulliken charges with hydrogens summed into heavy atoms:
elementType: O O N N C C C C C C C C C C C C C C C
charge: -0.040720 -0.230236 -0.014136 -0.110560 0.029164 0.072004 0.015895 0.475448 0.419314 0.024483 0.386790 -0.423945 -0.151778 -0.209663 -0.193728 -0.178370 -0.019100 -0.031026 0.180164
polarizability: 2.90794913e+02 4.78792858e+01 1.55903317e+02 2.91441774e+01 -1.50582973e+01 1.44322636e+02
1716.lowfreq: -4.9777 -4.3220 -0.0011 -0.0007 -0.0003 10.4404 13.0067 16.3209 20.6978
frequency: 10.4942 12.6095 17.7394 48.5529 65.7815 67.8455 104.4084 107.1022 138.2843 177.7441 180.0040 207.5220 239.2460 290.4046 334.7107 355.1088 382.3387 400.0153 459.0463 471.3737 478.4928 505.6118 514.8516 528.0984 555.8744 571.5818 591.7554 620.6297 643.2717 649.3592 684.0256 711.6251 752.4398 752.6952 760.3647 775.4079 810.5914 845.8226 860.7827 862.6767 879.9281 890.9419 937.0297 944.4851 964.1684 983.3382 988.8235 1007.8280 1021.6039 1047.3385 1069.5466 1080.4532 1112.9973 1119.4176 1121.8580 1138.6777 1165.3324 1171.6171 1180.9204 1209.6089 1232.1666 1242.9083 1246.0184 1268.9342 1277.4723 1281.9327 1286.8148 1318.7045 1342.2804 1355.0659 1376.0795 1398.7690 1404.5127 1419.7327 1441.1594 1442.3523 1444.7113 1465.9224 1474.1887 1491.7667 1501.1331 1503.9212 1530.7229 1581.7624 1611.4818 1644.9416 1670.2297 2838.5081 2900.8769 2981.6723 2983.5675 3003.7862 3009.6071 3040.8762 3073.5652 3107.8726 3114.9669 3119.2365 3120.8874 3138.7271 3151.9955 3159.4720 3426.5721 3511.8749 3553.8554
redmass: 5.8728 5.0106 10.0018 4.0788 2.3217 3.4970 2.6341 4.6933 2.4115 5.9492 3.6461 4.7505 3.1828 4.2324 4.0220 3.4934 4.2829 3.0579 2.0457 2.3646 2.6559 2.0376 6.4556 3.1652 2.7174 3.3265 4.0409 6.1528 1.3479 2.5749 1.3229 4.1197 1.3381 1.1822 4.8626 2.2165 1.4341 1.5111 3.1715 1.6122 4.4840 1.8972 4.1531 1.3578 1.4170 1.3397 3.1518 2.0396 2.2498 2.3090 2.4704 2.2403 2.3171 3.7613 1.9842 1.8405 1.2321 1.1015 1.3754 1.5943 1.2944 1.4287 1.5776 1.2162 1.7085 1.0755 1.4772 2.1125 1.4492 1.9232 1.7177 1.8643 1.7819 4.5929 1.0864 3.3556 1.3171 2.0290 1.0826 1.1080 1.1503 2.0987 2.8488 5.9791 5.5630 6.7211 8.2909 1.0713 1.0703 1.0847 1.0643 1.0631 1.0898 1.0944 1.1020 1.0908 1.0856 1.0887 1.0875 1.0945 1.0950 1.1001 1.0748 1.0639 1.0761
irintensity: 0.2002 0.1922 1.1134 0.9577 0.3663 1.3635 0.9534 0.9415 1.4022 1.0741 1.2716 1.3171 8.6624 1.3559 0.9119 6.9155 2.5562 1.0744 25.6882 39.1546 43.1153 59.4005 0.7032 10.1781 42.6549 5.5909 21.6763 1.4449 128.1756 2.0273 125.3374 6.3288 37.1612 13.8466 0.5367 0.2113 35.5971 67.4110 2.2047 4.5796 0.3408 17.2933 2.6668 0.4119 10.3314 0.1392 80.2848 110.0247 14.6971 112.4746 0.1420 44.4106 1.9875 92.3415 71.2725 62.1969 6.0452 5.4031 14.3140 38.9193 6.8675 9.5835 19.1659 16.3121 5.3378 1.2692 21.1499 233.7914 49.2023 5.8698 9.4008 1.1171 12.0019 5.1227 25.3901 8.7210 137.7239 1.7943 8.1107 10.7192 30.0636 148.5173 19.1309 5.4612 79.3180 245.4531 209.8796 113.2155 102.0575 27.1670 14.2715 27.7431 62.2171 2.3528 39.3544 19.2508 8.7636 4.3888 4.4139 38.0070 32.8974 37.1883 0.5548 21.2936 25.7504
temp: 298.150 k
press: 1.00000 atm
elementType: 8 8 7 7 6 6 6 6 6 6 6 6 6 6 6 6 6 6 6 1 1 1 1 1 1 1 1 1 1 1 1 1 1 1 1 1 1
symmnumber: 1
zpe: 795970.1 jmol-1
zpe.correction: 0.303169 hartree
zpe.thermalcorrener: 0.321375 hartree
zpe.thermalcorrenthalpy: 0.322320 hartree
zpe.thermalcorrgfe: 0.251899 hartree
zpe.sumelectzpe: -840.959292 hartree
zpe.sumelectthermal: -840.941085 hartree
zpe.sumelectthermalent: -840.940141 hartree
zpe.sumelectthermalfe: -841.010562 hartree
dipole: 2.2848 1.5609 1.4306
dipole: 3.1150
quadrupole: -105.1196 -111.2827 -110.9728
quadrupole: 5.8513 8.5708 -9.2653
quadrupole: 4.0054 -2.1577 -1.8477 5.8513 8.5708 -9.2653
hfenergy: -841.2624609 hartree
pointgroup: C01 [X(C15H18N2O2)]
dipole: 0.9078861 -0.5533809 0.6094722 debye
polarizability: 292.7957061|-29.8138636|147.419141|44.5964608|15.395878|150.8060183 unknown
InChI: InChI=1S/C15H18N2O2/c18-15(19)6-3-9-16-11-17-14-8-7-12-4-1-2-5-13(12)10-14/h1-2,4-5,7-8,10,16-18H,3,6,9,11H2
charge 0 multiplicity 1
37 atoms
O  7.74634 -0.283998 -1.171917
O  6.052436 0.853114 -2.279789
N  1.891245 0.131099 0.875074
N  -0.311866 0.277469 1.915157
C  3.221931 -0.511191 0.839275
C  4.134799 0.18774 -0.186203
C  0.95755 -0.428468 1.885672
C  -1.401453 0.011569 1.066809
C  -3.654281 0.621137 0.237067
C  5.536916 -0.448427 -0.230826
C  -3.664345 -0.543966 -0.627384
C  -2.519452 0.870321 1.066201
C  -1.416387 -1.140389 0.198164
C  -2.51737 -1.402289 -0.614371
C  -4.799806 1.489382 0.22644
C  -4.80285 -0.794748 -1.45962
C  -5.896194 1.219154 -0.595578
C  -5.902214 0.067921 -1.448236
C  6.410641 0.124767 -1.329429
H  3.174838 -1.606776 0.603897
H  3.666512 -0.427665 1.852606
H  4.207451 1.260094 0.06922
H  3.680516 0.137717 -1.194704
H  0.754377 -1.516398 1.744649
H  1.447028 -0.32806 2.873614
H  1.452397 0.171337 -0.056931
H  -0.297517 1.198763 2.354509
H  5.466305 -1.542033 -0.404721
H  6.069821 -0.332078 0.731481
H  -2.526662 1.751634 1.721348
H  -0.559163 -1.821025 0.172389
H  -2.508994 -2.283632 -1.267511
H  -4.802014 2.372976 0.876449
H  -4.799091 -1.678436 -2.109766
H  -6.761929 1.891314 -0.591859
H  -6.769459 -0.13023 -2.087392
H  8.290943 0.087901 -1.918281
