program: Gaussian 09
title: 000191053
version: EM64L-G09RevD.01
frameworkgroup: C1[X(C8H13NO2)]
method: RPBEPBE
basis: SDD
operation: Freq
keyword: #p
keyword: freq=noraman
keyword: PBEPBE/SDD
title: #p freq=noraman PBEPBE/SDD
converged: YES YES NO NO
title: Mulliken charges:
elementType: O O N C C C C C C C C H H H H H H H H H H H H H
charge: -0.417078 -0.250149 -0.386070 0.025242 0.397922 0.032484 -0.512966 -0.700906 0.097239 -0.788209 -0.682423 0.309599 0.212691 0.207285 0.251973 0.214012 0.236367 0.217080 0.254077 0.246346 0.211717 0.218637 0.259983 0.345146
chargesum: 0.00000
title: Mulliken charges with hydrogens summed into heavy atoms:
elementType: O O N C C C C C C C C
charge: -0.071931 -0.250149 -0.076471 0.025242 0.397922 0.032484 -0.092990 0.001447 0.097239 -0.070706 0.007914
polarizability: 1.21716291e+02 -7.87350959e+00 1.04095863e+02 2.39035217e+00 5.20994347e-01 7.11749526e+01
1716.lowfreq: -11.6370 -4.5526 -0.0007 -0.0005 0.0003 8.9362 63.6523 76.7113 87.6751
frequency: 63.3474 76.6477 87.6538 111.2487 147.0038 194.4784 225.6496 244.7500 253.1944 274.7328 277.9623 329.0546 345.2551 359.7165 462.4845 500.2540 531.4883 586.9789 602.9575 651.3637 673.7784 737.7430 761.4070 829.9422 879.8681 930.2686 955.7560 991.4126 1033.7346 1057.8359 1061.5864 1092.1432 1118.1354 1132.9884 1157.1450 1214.4149 1262.3401 1288.9090 1306.1207 1337.3594 1381.2218 1385.1050 1396.4742 1402.5800 1454.9177 1459.1894 1465.2118 1468.6679 1473.6802 1477.4529 1492.9697 1655.7383 1682.9962 2978.6375 2980.3875 2984.1662 2988.1986 3038.5307 3059.4505 3073.9683 3081.5898 3091.9499 3105.6726 3108.0846 3535.5985 3587.8531
redmass: 2.3205 1.1645 2.6793 5.8088 3.3145 1.2065 1.1238 2.7933 1.0954 2.2611 2.2719 3.2375 3.8435 3.4571 3.8459 1.2833 4.8106 3.4781 3.8573 5.1995 4.9328 5.9369 1.5220 2.0424 2.5490 2.2157 1.9780 1.5934 1.5214 1.7790 1.6441 3.1614 2.8020 2.3890 2.4075 2.4822 1.2242 1.5731 1.9868 2.7825 1.3142 1.2283 1.7772 1.3562 1.0604 1.0545 1.0553 1.0510 1.0961 1.0759 1.0712 8.9449 8.9655 1.0388 1.0381 1.0521 1.0422 1.1005 1.0949 1.0952 1.1001 1.1002 1.1008 1.1007 1.0661 1.0794
irintensity: 0.0757 0.5904 0.1414 1.1541 8.7819 0.6288 70.3268 1.8068 2.8200 3.6735 10.9475 5.6707 8.1967 15.5509 9.3233 141.9910 3.2925 2.3466 9.2292 19.3197 8.0083 14.1264 1.2514 18.6721 53.3280 5.8975 2.4348 15.7912 9.1579 50.6835 26.3788 74.7408 45.5855 24.6811 19.6654 56.0183 4.4360 11.6546 35.5741 25.7778 29.6924 29.8075 11.8329 24.3018 9.8734 9.0286 1.4395 10.4677 7.5447 9.9092 14.1514 380.9222 15.0007 25.9978 13.8047 37.6756 37.8025 17.0114 14.1456 21.1739 50.4427 10.0584 17.5485 21.3368 3.7683 28.4661
temp: 298.150 k
press: 1.00000 atm
elementType: 8 8 7 6 6 6 6 6 6 6 6 1 1 1 1 1 1 1 1 1 1 1 1 1
symmnumber: 1
zpe: 520132.7 jmol-1
zpe.correction: 0.198108 hartree
zpe.thermalcorrener: 0.210745 hartree
zpe.thermalcorrenthalpy: 0.211690 hartree
zpe.thermalcorrgfe: 0.159869 hartree
zpe.sumelectzpe: -516.998535 hartree
zpe.sumelectthermal: -516.985898 hartree
zpe.sumelectthermalent: -516.984954 hartree
zpe.sumelectthermalfe: -517.036774 hartree
dipole: 3.8266 -2.0415 1.7092
dipole: 4.6617
quadrupole: -80.2691 -51.7998 -67.9021
quadrupole: -0.5852 -0.2213 1.5508
quadrupole: -13.6121 14.8572 -1.2451 -0.5852 -0.2213 1.5508
hfenergy: -517.1966433 hartree
pointgroup: C01 [X(C8H13N1O2)]
dipole: 1.4875168 0.780148 -0.7365367 debye
dipolederiv: -0.7446359 -0.1461986 -0.0327008 -0.1520379 -0.228674 -0.0767597 -0.2294156 -0.125384 -0.7128136 -1.2738791 -0.2053205 0.1535875 0.0400701 -0.5314184 -0.029825 0.1875286 0.0037609 -0.3821831 -0.8695929 -0.3211394 -0.0313626 -0.263083 -0.8302094 0.0089572 0.0972224 -0.0274983 -0.5764489 0.9655809 0.2708056 0.0750008 0.1689796 0.3733219 -0.0269132 0.2009253 0.0547763 0.7725939 0.3357924 -0.1362146 -0.062472 -0.13463 -0.0238115 -0.0090973 -0.0479498 0.1217142 -0.1845427 -0.4074692 0.2967385 0.0672635 0.3579905 0.1569029 -0.0180793 0.0924886 -0.0749191 -0.0845646 -0.0120137 0.1000527 -0.0256113 0.1448834 0.0417462 0.0284245 -0.1526607 0.0432021 0.1006393 -0.0463567 -0.0678294 0.0221238 -0.079603 -0.0474678 0.1468721 -0.0230382 0.0169676 -0.1234618 1.5921476 0.2986905 -0.2248799 0.0789707 1.0265728 0.1069427 -0.2974972 0.0961318 0.2604022 -0.0035851 -0.0645956 0.0110413 -0.0933583 -0.1351925 -0.0031306 0.0456047 0.0249982 0.0760738 0.0342583 -0.0010654 -0.0307824 0.0008425 0.0506471 0.0091553 0.0898401 -0.0328517 -0.0078161 0.1466174 -0.0227735 0.0343883 -0.0055398 0.1175604 -0.0291454 0.0306215 0.0040136 0.3471421 0.0264262 -0.0241115 -0.0613246 0.0147308 -0.062324 -0.1251626 -0.0126456 -0.093413 -0.0410116 -0.0312268 -0.0718282 0.0712821 -0.0938811 -0.0182231 0.1104933 0.0678432 0.0754846 0.0039451 0.0300366 -0.016774 -0.101711 -0.0244468 0.101954 -0.0466748 -0.0929814 -0.0239107 -0.0354613 0.0767539 0.0243959 0.0236826 -0.0138806 -0.1724195 -0.0270089 0.0275712 -0.0767707 0.0427369 -0.1207237 0.0042238 0.0707799 0.040823 0.0907103 -0.0115683 0.0511933 0.0192499 0.0683459 0.0031154 0.1070332 0.1029606 0.0459417 0.0010215 -0.048904 0.0604565 -0.0934739 0.0292898 -0.0462826 -0.0505826 -0.0901885 0.0086839 0.088463 0.013016 -0.0881724 -0.0247294 0.0794678 0.1083837 -0.0111488 -0.001652 -0.0482977 0.0163546 0.0531605 0.0099933 0.0942869 -0.0631913 -0.1689273 0.1357759 0.0300693 0.1558532 0.0234756 -0.0056553 0.0264799 -0.0176008 0.0574708 0.0048156 -0.1179568 0.0666373 -0.0682635 -0.0272451 0.0893982 0.031203 0.0734857 0.0265345 0.1039872 -0.031182 -0.0278142 -0.0691477 0.0221415 -0.1031203 -0.0343645 -0.0694552 0.0005288 0.2967777 0.0510049 -0.0383177 -0.0116 -0.0338863 -0.0053749 -0.0402461 0.031935 0.3463243 unknown
polarizability: 121.6319701|7.6551745|103.9270682|-4.3753134|-0.0320385|71.428068 unknown
InChI: InChI=1S/C8H13NO2/c1-4-6-5(2)7(10)9-8(6,3)11/h9,11H,4H2,1-3H3
charge 0 multiplicity 1
24 atoms
O  1.379084 1.395473 1.108946
O  -2.947817 0.074633 0.506661
N  -0.958958 1.363228 0.342097
C  0.449258 1.159353 -0.019918
C  0.494783 -0.35469 -0.300449
C  -0.745192 -0.900312 -0.122476
C  1.787134 -1.056569 -0.630099
C  0.855001 2.04516 -1.218444
C  -1.710165 0.183938 0.28484
C  -1.203505 -2.323567 -0.256365
C  2.480446 -1.638661 0.635314
H  -1.379163 2.272853 0.528336
H  1.591734 -1.879691 -1.344879
H  2.48563 -0.357215 -1.126752
H  0.219019 1.829255 -2.093465
H  0.739879 3.117859 -0.966358
H  1.909545 1.865917 -1.489068
H  -0.507491 -2.927846 -0.863399
H  -2.209421 -2.359161 -0.710928
H  -1.292253 -2.802627 0.737546
H  3.431752 -2.131024 0.36216
H  1.832114 -2.385955 1.126678
H  2.687936 -0.834153 1.359641
H  1.495351 2.373902 1.228578
