program: Gaussian 09
title: 000190520
version: EM64L-G09RevD.01
frameworkgroup: C1[X(C10H17F2N5S)]
method: RPBEPBE
basis: SDD
operation: Freq
keyword: #p
keyword: freq=noraman
keyword: PBEPBE/SDD
title: #p freq=noraman PBEPBE/SDD
converged: YES YES NO NO
title: Mulliken charges:
elementType: S F F N N N N N C C C C C C C C C C H H H H H H H H H H H H H H H H H
charge: 0.273438 -0.179545 -0.179376 -0.343895 -0.344635 -0.125936 -0.103762 -0.047120 -0.029232 -0.030509 -0.713711 -0.670550 -0.713802 -0.669700 0.050819 0.083853 -0.252030 -0.099955 0.248817 0.234063 0.320484 0.323652 0.227534 0.204006 0.233684 0.253881 0.212361 0.200392 0.228483 0.206251 0.234531 0.247661 0.214112 0.205884 0.299853
chargesum: 0.00000
title: Mulliken charges with hydrogens summed into heavy atoms:
elementType: S F F N N N N N C C C C C C C C C C
charge: 0.273438 -0.179545 -0.179376 -0.023411 -0.020983 -0.125936 -0.103762 -0.047120 0.219585 0.203554 -0.048487 -0.003916 -0.044536 -0.002043 0.050819 0.083853 -0.252030 0.199899
polarizability: 2.39741914e+02 4.11759182e+00 1.84678134e+02 -1.47230156e+00 -1.01038728e+00 1.06908059e+02
1716.lowfreq: -7.7363 -4.9535 -0.0013 -0.0012 0.0010 2.9151 18.0941 30.8446 39.5011
frequency: 18.0651 30.8216 39.4673 43.0135 44.5789 68.1259 83.8305 91.8390 144.6280 149.7977 173.6549 191.8786 215.3808 215.6444 234.9505 238.2573 247.6839 269.4419 309.3834 314.5041 328.0947 356.8336 408.3877 413.6871 422.2363 445.3841 463.6564 515.6314 527.6182 559.6071 576.6290 637.0115 659.4639 665.3207 709.0525 714.5026 789.5469 838.4345 840.5887 876.4026 914.0635 914.6383 921.8107 923.9557 949.1251 949.5959 951.5797 971.0839 994.2753 1027.9578 1133.3789 1137.0466 1144.4148 1167.1065 1181.4142 1186.4019 1220.2841 1239.2296 1264.6166 1294.2887 1302.3002 1308.1447 1335.8535 1345.4075 1360.2287 1378.1491 1380.0872 1395.0634 1397.2859 1417.1405 1446.6598 1463.3432 1465.9342 1468.6187 1468.9157 1476.0498 1482.3271 1486.7385 1487.7435 1490.7083 1544.6407 1590.0631 2976.9982 2978.8087 2982.7331 2983.0967 3020.0669 3032.4282 3071.3801 3072.8207 3079.3379 3082.9577 3083.0871 3093.9822 3095.1014 3097.5370 3098.5887 3548.3970 3549.6770
redmass: 7.8613 4.4173 3.8469 3.8051 3.2115 5.3538 3.8002 4.0532 6.4504 7.6499 7.8780 6.3340 1.0297 1.0310 1.5707 3.3035 1.0981 2.1692 13.8035 3.2179 3.6290 3.9121 2.5420 3.9841 9.6096 2.8938 2.7034 10.2842 4.4328 1.1598 1.1660 11.4231 7.1124 6.1793 9.7061 6.4805 12.2179 2.6026 2.5840 8.3611 3.3797 2.3601 1.2257 1.3173 1.5092 1.5204 8.5718 7.9281 2.5611 2.6012 2.3715 2.1218 2.1266 1.9461 2.1961 2.6369 2.2222 1.4078 5.4067 1.1160 1.7429 1.5935 1.8499 1.2670 1.4143 1.2135 1.2104 1.2420 1.2322 1.5864 3.8420 1.0701 1.1373 1.0535 1.0489 1.2740 1.0901 1.0894 1.0627 1.7031 5.7128 6.6653 1.0377 1.0375 1.0362 1.0363 1.0846 1.0854 1.0984 1.0987 1.0904 1.0989 1.0992 1.1002 1.0996 1.0995 1.1000 1.0766 1.0767
irintensity: 0.4089 0.2559 0.2126 0.6987 1.5042 0.4798 1.0987 0.3148 1.6032 3.7644 0.0741 0.0460 0.0965 0.0976 0.7504 0.0121 0.1729 1.2010 1.0306 2.0829 9.0048 1.7102 0.0191 5.5988 1.0188 0.5996 0.9061 9.3888 13.6823 9.3749 182.0383 10.2579 1.3954 54.6807 0.2343 101.0856 23.0791 10.4934 0.1085 24.4317 37.4264 15.0127 6.5118 7.3547 14.3137 8.5374 175.5334 311.7213 0.6871 10.4958 8.6393 58.8091 0.7310 25.7183 8.6734 124.7861 57.8654 9.3124 14.1885 7.1672 100.7631 23.3030 204.4294 56.1733 125.7867 26.1503 25.7459 38.4289 8.3712 54.5577 1.8373 6.8931 9.5728 5.4442 9.6094 79.1485 20.8490 85.0746 34.0050 194.3959 1948.2760 105.4839 26.6334 24.1899 46.7561 16.0849 4.0896 0.4737 12.2846 11.8323 8.5086 56.6649 52.1164 22.8059 26.5156 43.1608 32.9187 39.4309 80.8355
temp: 298.150 k
press: 1.00000 atm
elementType: 16 9 9 7 7 7 7 7 6 6 6 6 6 6 6 6 6 6 1 1 1 1 1 1 1 1 1 1 1 1 1 1 1 1 1
symmnumber: 1
zpe: 721932.6 jmol-1
zpe.correction: 0.274970 hartree
zpe.thermalcorrener: 0.295348 hartree
zpe.thermalcorrenthalpy: 0.296292 hartree
zpe.thermalcorrgfe: 0.223192 hartree
zpe.sumelectzpe: -1261.393551 hartree
zpe.sumelectthermal: -1261.373172 hartree
zpe.sumelectthermalent: -1261.372228 hartree
zpe.sumelectthermalfe: -1261.445328 hartree
dipole: 2.3449 -6.0305 0.0644
dipole: 6.4707
quadrupole: -97.1835 -117.0892 -118.0588
quadrupole: 11.8596 -1.4204 -0.6661
quadrupole: 13.5937 -6.3120 -7.2817 11.8596 -1.4204 -0.6661
hfenergy: -1261.6685203 hartree
pointgroup: C01 [X(C10H17F2N5S1)]
dipole: 0.7894889 2.4165298 0.1340671 debye
polarizability: 239.9506276|-1.2356133|184.2190654|3.5007314|3.7656782|107.1584145 unknown
InChI: InChI=1S/C10H17F2N5S/c1-5(2)13-8-15-9(14-6(3)4)17-10(16-8)18-7(11)12/h5-7,13-14H,1-4H3
charge 0 multiplicity 1
35 atoms
S  -0.362305 -2.819004 -0.126229
F  -2.84239 -3.408978 0.826362
F  -2.696359 -3.303013 -1.44256
N  2.989849 0.920481 0.220127
N  -1.498971 2.186315 -0.059909
N  0.75612 1.597526 0.082913
N  -0.974774 -0.117792 -0.072971
N  1.359008 -0.773217 0.042979
C  4.115561 -0.044308 0.231469
C  -2.960809 1.959793 -0.137371
C  5.30888 0.596677 0.967553
C  4.483295 -0.489079 -1.203771
C  -3.622858 3.210889 -0.748117
C  -3.548942 1.608073 1.249932
C  1.674127 0.576787 0.110782
C  -0.553353 1.202422 -0.012405
C  0.034989 -1.018507 -0.043165
C  -2.228134 -2.690422 -0.242104
H  3.764565 -0.931297 0.788555
H  -3.114907 1.097133 -0.811685
H  3.186431 1.923543 0.240891
H  -1.141949 3.141881 0.007767
H  6.151476 -0.114559 1.012674
H  5.664771 1.501226 0.436576
H  5.03894 0.878546 2.000923
H  3.607374 -0.940759 -1.699146
H  5.290878 -1.243337 -1.175308
H  4.831895 0.369995 -1.806685
H  -4.711216 3.05546 -0.84264
H  -3.467632 4.097591 -0.103064
H  -3.216525 3.429931 -1.75157
H  -3.049001 0.717609 1.667685
H  -4.629766 1.39193 1.165794
H  -3.417713 2.448692 1.956021
H  -2.522355 -1.629129 -0.212803
