program: Gaussian 09
title: 000190493
version: EM64L-G09RevD.01
frameworkgroup: C1[X(C12H11FO)]
method: RPBEPBE
basis: SDD
operation: Freq
keyword: #p
keyword: freq=noraman
keyword: PBEPBE/SDD
title: #p freq=noraman PBEPBE/SDD
converged: YES YES NO YES
title: Mulliken charges:
elementType: F O C C C C C C C C C C C C H H H H H H H H H H H
charge: -0.196598 -0.211145 -0.185875 -0.579823 0.331569 0.116615 -0.495490 -0.722890 0.330956 -0.308486 -0.330234 -0.384009 -0.393481 0.336981 0.251060 0.238985 0.240237 0.262622 0.216971 0.216708 0.252228 0.238887 0.253492 0.261226 0.259494
chargesum: 0.00000
title: Mulliken charges with hydrogens summed into heavy atoms:
elementType: F O C C C C C C C C C C C C
charge: -0.196598 -0.211145 0.065185 -0.100601 0.331569 0.116615 -0.232869 -0.036983 0.330956 -0.069599 -0.076742 -0.122782 -0.133987 0.336981
polarizability: 2.27329131e+02 1.43021240e+01 1.30287569e+02 -1.43436492e+00 3.75475906e+00 6.58691127e+01
1716.lowfreq: -7.5592 -0.0014 -0.0011 -0.0009 2.9527 6.6915 31.6986 57.0308 84.1985
frequency: 31.5630 56.9964 84.1629 114.4151 152.1760 220.7941 237.8488 271.3249 295.4552 319.6018 381.0121 408.5284 412.8290 465.1526 516.4661 546.5799 562.0113 600.2703 629.7344 678.5551 726.0815 769.8561 780.8729 815.8184 836.4037 837.4365 888.1214 910.8696 918.6041 954.8915 962.7900 981.8342 1004.4149 1026.4880 1080.6343 1109.1253 1121.7945 1159.5231 1181.3897 1195.5481 1213.9158 1225.5437 1244.2729 1270.7064 1295.4726 1298.4829 1315.0341 1376.7224 1386.6203 1415.6358 1450.0819 1473.0531 1480.8282 1497.9303 1584.2349 1600.5306 1608.1068 1622.6621 2977.4241 2982.4748 2990.3377 3031.3405 3077.9867 3091.5077 3153.8502 3155.2023 3177.6268 3179.6571 3181.9283
redmass: 3.6204 4.7217 3.4541 5.2577 6.9939 1.1363 2.8523 5.9555 5.8856 6.4663 2.5332 2.9798 4.1576 3.3434 3.4276 2.5461 6.5286 5.9564 7.0130 3.2850 3.7024 2.8992 6.9955 1.2569 2.5453 2.3826 1.5725 1.6867 1.7875 1.3775 1.3666 3.4382 2.5516 1.5326 1.9056 1.3372 1.8950 1.5192 1.4559 1.8220 2.1830 1.5587 1.8561 1.8104 1.7628 1.4973 2.2936 6.3701 1.2067 3.7998 1.1199 1.0463 1.0536 2.5315 6.8337 7.2310 6.7612 9.9765 1.0596 1.0366 1.0838 1.0997 1.1004 1.0999 1.0890 1.0884 1.0965 1.0966 1.0971
irintensity: 0.8140 1.6892 0.7748 2.2784 0.6312 1.0955 2.7894 3.6404 3.3755 3.3465 0.5558 0.7286 6.5691 13.6312 3.4516 4.3209 15.2361 9.5580 0.4100 0.9962 0.1612 8.0808 15.7930 0.9125 50.3751 54.7974 17.5107 2.6123 3.2765 0.1597 0.0287 1.1218 10.8839 9.4203 3.7392 10.1748 9.2917 93.4492 40.8024 82.9708 11.8234 2.8165 5.8718 44.9696 19.3412 5.1953 32.4061 21.8112 23.8889 16.7151 20.7266 15.5398 9.9829 99.3294 46.0331 239.8793 109.8366 126.2736 19.2953 35.4975 4.9346 16.4225 37.9621 14.5245 3.9940 6.2736 1.2764 5.4414 7.0750
temp: 298.150 k
press: 1.00000 atm
elementType: 9 8 6 6 6 6 6 6 6 6 6 6 6 6 1 1 1 1 1 1 1 1 1 1 1
symmnumber: 1
zpe: 512044.4 jmol-1
zpe.correction: 0.195027 hartree
zpe.thermalcorrener: 0.207284 hartree
zpe.thermalcorrenthalpy: 0.208229 hartree
zpe.thermalcorrgfe: 0.155489 hartree
zpe.sumelectzpe: -637.942335 hartree
zpe.sumelectthermal: -637.930078 hartree
zpe.sumelectthermalent: -637.929133 hartree
zpe.sumelectthermalfe: -637.981873 hartree
dipole: -2.0423 -2.7070 -0.3420
dipole: 3.4082
quadrupole: -105.4949 -75.3080 -82.8777
quadrupole: -12.8790 -0.7992 1.1478
quadrupole: -17.6013 12.5855 5.0158 -12.8790 -0.7992 1.1478
hfenergy: -638.1373619 hartree
pointgroup: C01 [X(C12H11F1O1)]
dipole: 0.819889 -1.0557558 0.1056972 debye
dipolederiv: -1.4092584 0.0459466 0.0693288 0.0214353 -0.2064299 0.0016538 0.0796361 0.0001421 -0.1520948 -1.2120224 0.3541772 0.0099912 0.3630566 -0.7042629 0.010881 -0.0103503 0.0279646 -0.3384468 -0.0262912 -0.0742837 -0.010507 -0.1088713 -0.3376889 0.03882 -0.032368 0.0715835 0.1129436 -0.1456399 -0.0443313 0.0051627 -0.0821271 -0.1159185 0.0036997 0.0010327 -0.0120862 0.1439064 0.9656488 -0.020322 -0.0560786 -0.246453 0.3241999 -0.0179224 -0.0491448 -0.02606 -0.0223941 1.8530514 -0.3878771 -0.058696 0.1527128 0.8044212 -0.0793327 -0.1284281 -0.1166416 0.125405 -1.2853271 0.2220465 0.0252106 0.0843176 -0.0991652 -0.0272155 0.0710549 -0.019111 -0.1655148 0.0497044 0.0441781 -0.0391862 -0.002817 0.0870538 -0.0279751 0.026562 0.0154485 0.0680162 -0.3003451 -0.0639189 0.0204414 -0.1194184 -0.1246975 0.0113068 0.0515426 0.0121759 -0.0008112 0.0898223 -0.0072088 -0.0171842 0.0879874 0.08365 -0.0091324 -0.0320846 -0.0081276 -0.1062089 0.1903408 -0.0111632 -0.0181229 -0.0543766 0.0661611 -0.0080517 -0.0087446 -0.0091433 -0.1332872 -0.3013175 0.0536943 0.0055935 0.3078411 -0.0478254 -0.022623 -0.0052999 -0.0095661 -0.1554506 -0.3683744 -0.0309676 0.0113032 -0.3593901 -0.0152086 0.0118632 0.0292146 -0.0047954 -0.1562895 1.4726685 -0.0383048 -0.0794858 0.0143316 0.2975779 -0.0102553 -0.0884748 -0.0070592 0.1083061 0.0333984 0.0032834 0.0421907 -0.0191796 0.068167 0.0123005 0.059476 0.0068562 -0.0992498 0.0670828 0.0087022 0.0252565 0.0335994 -0.0158945 -0.0740184 0.0480594 -0.0982233 -0.0292738 0.0311889 0.0264106 -0.0560278 0.0479627 0.0128779 0.0757645 -0.0756883 0.0944162 -0.0312549 0.0440884 -0.0814193 0.0117313 -0.1028849 -0.0345128 0.0284737 0.0189055 0.0341161 0.1675186 0.04828 -0.0100322 0.1032403 -0.0144606 0.0718983 0.0240768 0.0300577 -0.0114702 -0.1288629 0.0688391 -0.0173849 -0.0162166 -0.1010842 -0.1632681 0.0296718 -0.0209712 0.0481579 0.0612745 -0.0921003 0.0238532 -0.0064712 0.1238274 0.0746984 -0.0056706 0.00645 -0.023262 0.092669 0.0685617 0.0940962 0.0019778 0.0583523 -0.0180439 0.0036792 0.0036059 0.0031102 0.139997 0.0780278 -0.0891873 0.0101326 -0.0860328 -0.0209148 0.0123001 0.0077081 0.0144912 0.1398843 0.0371201 -0.0571933 0.0113111 -0.0741388 0.0110377 0.0129251 0.0138554 0.0114637 0.1794293 0.0428527 0.0572063 0.0051046 0.0758101 0.0020878 0.0047809 0.0043938 0.0056199 0.1797893 unknown
polarizability: 227.5502127|-13.0679619|130.0023596|-4.9692985|-2.8018794|65.9332404 unknown
InChI: InChI=1S/C12H11FO/c1-8-6-10(7-12(8)14)9-2-4-11(13)5-3-9/h2-5,7-8H,6H2,1H3
charge 0 multiplicity 1
25 atoms
F  4.947733 -0.057807 -0.184506
O  -3.98255 1.532501 0.152084
C  -3.036119 -0.759194 0.46523
C  -1.557653 -1.223544 0.354609
C  -0.735987 0.056381 0.171868
C  -2.97761 0.769774 0.22549
C  -1.560239 1.156997 0.094245
C  -4.0199 -1.453256 -0.502134
C  0.735212 0.037419 0.080372
C  1.491391 1.242678 -0.030197
C  1.44309 -1.199318 0.102131
C  2.894712 1.220869 -0.118958
C  2.849016 -1.243669 0.013425
C  3.544443 -0.027946 -0.095776
H  -3.401842 -0.906462 1.501338
H  -1.418569 -1.896919 -0.514643
H  -1.22669 -1.787569 1.247394
H  -1.262878 2.19653 -0.061693
H  -3.672551 -1.365033 -1.548187
H  -4.12607 -2.526633 -0.262146
H  -5.013114 -0.976352 -0.433199
H  0.976655 2.208183 -0.042753
H  0.890715 -2.140069 0.186029
H  3.48071 2.140423 -0.202774
H  3.398093 -2.189285 0.027654
