program: Gaussian 09
title: 000190490
version: EM64L-G09RevD.01
frameworkgroup: C1[X(C14H30)]
method: RPBEPBE
basis: SDD
operation: Freq
keyword: #p
keyword: freq=noraman
keyword: PBEPBE/SDD
title: #p freq=noraman PBEPBE/SDD
converged: YES YES NO NO
title: Mulliken charges:
elementType: C C C C C C C C C C C C C C H H H H H H H H H H H H H H H H H H H H H H H H H H H H H H
charge: 0.358759 -0.435881 0.301265 -0.440327 -0.766241 -0.760315 -0.411645 -0.726438 -0.726021 -0.728662 -0.370790 -0.355429 -0.356473 -0.697365 0.184752 0.183619 0.187727 0.190167 0.222073 0.210892 0.208285 0.230589 0.205637 0.207010 0.208817 0.212674 0.205093 0.226868 0.201352 0.203462 0.214893 0.206709 0.211159 0.209597 0.212277 0.186078 0.186977 0.187332 0.187134 0.194789 0.195288 0.209756 0.209719 0.214840
chargesum: 0.00000
title: Mulliken charges with hydrogens summed into heavy atoms:
elementType: C C C C C C C C C C C C C C
charge: 0.358759 -0.067511 0.301265 -0.062433 -0.124991 -0.117079 0.009846 -0.093125 -0.100957 -0.095629 0.002265 0.019037 0.033604 -0.063050
polarizability: 1.73524162e+02 -6.77037183e-01 1.49957640e+02 -1.25988447e+00 -1.23716413e-01 1.34115190e+02
1716.lowfreq: -13.9918 -6.6315 -0.0006 0.0004 0.0004 0.8270 25.5452 39.5754 53.0397
frequency: 25.3827 39.0161 52.8054 71.4302 85.7640 123.7344 145.8545 171.5109 174.1574 201.6122 216.2026 218.4263 224.2898 242.4942 250.8329 262.8276 278.5129 297.3761 301.6988 311.3670 334.4833 354.3818 384.9905 399.3890 409.6369 429.9068 472.4244 499.2525 532.9595 722.6693 726.8879 738.3511 765.7492 780.7967 846.0836 861.3172 876.8382 890.6883 916.2810 924.5274 930.6616 934.1689 936.7040 964.4084 982.8088 991.3841 1008.4799 1021.8293 1025.8550 1043.2173 1066.8616 1072.7043 1079.0341 1107.7585 1133.0498 1163.4331 1189.3463 1208.5717 1215.0505 1235.7440 1241.2836 1251.4667 1258.9629 1281.9211 1284.0084 1289.1412 1301.0561 1315.0114 1332.0060 1344.2770 1351.1777 1355.2304 1369.7529 1372.0425 1375.6908 1387.1934 1392.2968 1399.0571 1449.6348 1458.3655 1458.8797 1461.9619 1463.7503 1465.8507 1467.1397 1468.7566 1473.3802 1475.5204 1476.2980 1480.2598 1483.5784 1487.0827 1488.5122 1491.4255 1494.7317 1502.1199 2938.4527 2945.9566 2950.8309 2953.1492 2961.6168 2964.7506 2966.4857 2967.1908 2970.5424 2971.0509 2973.2926 2977.6860 2984.4821 2991.1254 2999.2002 3003.5290 3026.0505 3043.2298 3052.5570 3053.6942 3056.4509 3060.3787 3060.8961 3064.7120 3067.6729 3068.3742 3070.0496 3076.6636 3084.1936 3091.6474
redmass: 3.3945 2.4570 1.7369 3.1453 2.5958 1.8650 2.1084 2.4050 2.6954 2.1430 2.1766 1.0710 1.1355 1.3907 1.4258 1.2267 1.7949 1.6538 1.5559 1.4033 2.5051 2.0836 2.1869 2.4511 1.8994 2.4158 2.3810 2.6368 2.3769 1.1121 3.0508 1.1242 3.3663 1.2143 1.8007 1.6488 1.8099 1.8131 1.7016 1.6694 1.5785 1.4767 1.2403 1.5495 1.4326 1.6764 2.0851 1.5727 1.4477 2.4023 2.5266 1.3683 2.1723 2.0725 1.8394 2.2251 1.8703 1.9805 1.8738 1.7673 2.1150 2.9757 1.5216 1.0760 1.2999 1.1947 1.1818 1.4242 1.4597 1.3737 1.6538 1.5585 1.2044 1.2053 1.2002 1.2170 1.2077 1.2132 1.0694 1.0589 1.0515 1.0738 1.0554 1.0695 1.0574 1.0610 1.0559 1.0428 1.0625 1.0619 1.0720 1.0696 1.0729 1.0564 1.0764 1.0569 1.0594 1.0594 1.0613 1.0589 1.0346 1.0358 1.0585 1.0358 1.0372 1.0368 1.0378 1.0607 1.0969 1.0999 1.0954 1.0999 1.1040 1.1039 1.0998 1.0994 1.0993 1.0994 1.0990 1.0982 1.1007 1.0989 1.0993 1.0995 1.0971 1.0963
irintensity: 0.0018 0.0028 0.0019 0.0129 0.0059 0.0069 0.0133 0.0162 0.0146 0.0612 0.0692 0.0905 0.0016 0.1657 0.1351 0.0260 0.0267 0.0252 0.0519 0.0904 0.1905 0.0421 0.6029 0.2022 0.0170 0.1952 0.3550 1.2428 0.0079 12.5532 0.3654 0.2522 0.7571 4.3783 2.2981 0.6775 2.3324 3.1022 3.0084 1.4112 1.1566 1.5723 0.2024 5.0773 1.8537 1.6753 0.3766 0.1630 0.5320 4.5859 0.9805 1.4922 0.4058 8.5073 1.2696 2.5296 0.1595 6.4941 1.0083 21.3817 8.9058 11.0437 5.3924 0.7499 2.0728 0.0959 4.8840 1.3431 0.4411 7.8726 2.3879 2.3843 5.2556 14.1310 34.1600 10.3432 18.3210 15.4496 0.9140 1.7610 3.5419 0.6167 2.8119 1.0707 1.3076 3.4357 4.8574 12.3716 0.5124 1.2091 12.9359 13.4124 8.3844 13.1630 39.8656 16.0245 37.6578 1.8475 12.9978 21.2194 40.0447 28.3481 54.5250 44.5474 69.4675 28.0533 16.5848 57.6090 1.0566 32.2669 20.5825 10.3289 7.8097 120.2251 19.1465 7.2896 13.8047 36.8404 103.5568 94.9430 100.9706 53.4393 56.1377 35.9381 49.2217 37.9152
temp: 298.150 k
press: 1.00000 atm
elementType: 6 6 6 6 6 6 6 6 6 6 6 6 6 6 1 1 1 1 1 1 1 1 1 1 1 1 1 1 1 1 1 1 1 1 1 1 1 1 1 1 1 1 1 1
symmnumber: 1
zpe: 1068975.3 jmol-1
zpe.correction: 0.407151 hartree
zpe.thermalcorrener: 0.426291 hartree
zpe.thermalcorrenthalpy: 0.427235 hartree
zpe.thermalcorrgfe: 0.360349 hartree
zpe.sumelectzpe: -550.283811 hartree
zpe.sumelectthermal: -550.264671 hartree
zpe.sumelectthermalent: -550.263727 hartree
zpe.sumelectthermalfe: -550.330613 hartree
dipole: -0.0280 0.0108 -0.0228
dipole: 0.0377
quadrupole: -94.9393 -93.4310 -94.6685
quadrupole: 0.6686 0.4890 -0.0445
quadrupole: -0.5930 0.9152 -0.3223 0.6686 0.4890 -0.0445
hfenergy: -550.6909624 hartree
pointgroup: C01 [X(C14H30)]
dipole: 0.0105574 0.0042687 0.009495 debye
polarizability: 173.4368949|1.857621|150.0251638|-0.1618823|0.9732043|134.1349335 unknown
InChI: InChI=1S/C14H30/c1-7-8-9-10-11-14(5,6)12-13(2,3)4/h7-12H2,1-6H3
charge 0 multiplicity 1
44 atoms
C  1.467008 1.425846 0.195633
C  2.135801 0.152766 0.834412
C  2.446934 -1.184445 0.065692
C  0.133668 1.149829 -0.568953
C  1.194149 2.406771 1.375979
C  2.437441 2.157154 -0.778331
C  -1.063935 0.647891 0.272029
C  1.181558 -2.071628 -0.1068
C  3.110899 -0.979286 -1.321506
C  3.447951 -1.97083 0.965461
C  -2.268479 0.237374 -0.606296
C  -3.506461 -0.196247 0.21075
C  -4.704386 -0.617544 -0.671064
C  -5.939116 -1.044109 0.152324
H  1.524595 -0.138973 1.715254
H  3.101247 0.510606 1.253857
H  0.328738 0.430897 -1.390407
H  -0.169508 2.095679 -1.067872
H  0.555765 1.949018 2.153306
H  0.689588 3.323311 1.01455
H  2.14339 2.71007 1.85762
H  2.569697 1.613411 -1.72815
H  3.43561 2.289481 -0.318708
H  2.042587 3.162282 -1.022634
H  -1.386902 1.443382 0.972937
H  -0.761916 -0.215144 0.897293
H  1.458708 -3.046536 -0.552768
H  0.429027 -1.605956 -0.765739
H  0.70303 -2.273101 0.870839
H  3.447807 -1.954116 -1.724272
H  3.993144 -0.316729 -1.253827
H  2.407783 -0.543893 -2.053878
H  4.412355 -1.434701 1.049117
H  3.650246 -2.974837 0.546156
H  3.044077 -2.104316 1.987409
H  -1.96512 -0.59332 -1.278622
H  -2.544835 1.085058 -1.268532
H  -3.817543 0.636628 0.875908
H  -3.22939 -1.039147 0.87826
H  -4.976636 0.224224 -1.340234
H  -4.39298 -1.451626 -1.332875
H  -5.698262 -1.899604 0.811555
H  -6.291606 -0.215455 0.795333
H  -6.77893 -1.346233 -0.500402
