program: Gaussian 09
title: 000190466
version: EM64L-G09RevD.01
frameworkgroup: C1[X(C24H27O3P)]
method: RPBEPBE
basis: SDD
operation: Freq
keyword: #p
keyword: freq=noraman
keyword: PBEPBE/SDD
title: #p freq=noraman PBEPBE/SDD
converged: YES YES NO NO
title: Mulliken charges:
elementType: P O O O C C C C C C C C C C C C C C C C C C C C C C C C H H H H H H H H H H H H H H H H H H H H H H H H H H H
charge: 1.010674 -0.528817 -0.550042 -0.538690 0.162539 0.165483 0.155731 0.363279 0.389626 0.385497 0.219473 0.194096 0.206344 -0.449558 -0.454750 -0.451715 -0.383458 -0.352367 -0.369985 -0.825941 -0.820300 -0.806999 -0.208418 -0.227926 -0.209637 -0.834507 -0.808480 -0.810665 0.230267 0.231553 0.232359 0.245910 0.255452 0.240070 0.269873 0.254266 0.227728 0.221900 0.223947 0.282556 0.213660 0.229994 0.275148 0.227816 0.227188 0.226580 0.236038 0.233925 0.227157 0.226528 0.228040 0.226688 0.227755 0.227944 0.229172
chargesum: 0.00000
title: Mulliken charges with hydrogens summed into heavy atoms:
elementType: P O O O C C C C C C C C C C C C C C C C C C C C C C C C
charge: 1.010674 -0.528817 -0.550042 -0.538690 0.162539 0.165483 0.155731 0.363279 0.389626 0.385497 0.219473 0.194096 0.206344 -0.219292 -0.223197 -0.219356 -0.137549 -0.096915 -0.129915 -0.074074 -0.091897 -0.088197 0.019397 -0.000738 0.016943 -0.137387 -0.127223 -0.125794
polarizability: 3.87723015e+02 -2.99344804e-01 2.55933324e+02 -1.83277290e+01 5.42039991e+00 2.61607415e+02
1716.lowfreq: -13.9130 -10.4484 -0.6538 -0.0017 -0.0005 0.0002 4.4357 11.0257 14.7424
frequency: -12.5228 9.3077 13.1903 21.9910 25.3465 33.1607 38.3530 64.4219 72.3241 77.5349 81.9603 91.8530 108.8011 113.0406 142.3768 145.1836 149.4185 152.1544 177.0466 190.5515 197.2234 232.6785 236.2869 243.4749 271.9352 282.3427 290.8043 296.3369 301.8641 307.7935 313.1051 319.7528 337.9355 444.9582 458.2311 467.8430 475.3618 482.3923 492.9786 507.2476 508.0063 509.8106 511.1719 511.9104 531.5455 566.2190 567.0794 572.7451 611.8790 619.8481 653.2721 677.1923 694.2119 710.0423 715.0699 716.1804 718.4889 779.9367 782.1386 785.0640 807.4722 808.2259 810.5419 883.4655 886.1281 888.4226 889.5978 892.8792 904.2112 963.5014 964.1790 967.0456 987.1402 989.2885 992.5781 1026.6519 1027.8675 1032.0011 1049.7918 1052.3093 1053.3010 1054.3477 1054.5004 1063.7892 1087.1013 1088.5069 1091.5407 1165.9791 1168.6854 1173.5094 1190.3982 1190.5256 1193.8019 1222.3332 1226.7442 1233.0016 1261.1676 1262.0501 1263.1569 1368.7858 1369.1510 1369.4134 1390.3352 1392.4359 1394.4720 1401.8879 1404.0375 1405.2747 1428.1514 1431.5961 1433.7459 1449.9402 1458.1007 1458.1605 1459.1469 1463.9216 1465.6711 1468.8490 1470.5729 1477.2992 1479.0827 1479.9975 1481.9544 1482.1378 1485.5187 1489.2313 1583.5535 1584.0100 1586.7871 1605.6586 1607.8826 1609.4759 2970.2639 2972.0990 2973.0816 2974.4589 2976.1285 2990.1200 3039.7557 3042.9326 3044.4653 3047.3217 3053.6388 3065.8922 3084.0452 3085.3550 3085.8779 3113.1758 3114.1401 3117.4010 3124.1287 3125.6331 3126.0682 3134.5882 3140.2766 3141.7870 3158.0078 3161.3792 3162.5686
redmass: 4.2378 4.4733 3.7520 3.8359 3.8617 3.7891 3.8192 1.2227 5.0113 1.3732 2.0305 1.1663 3.0292 3.3977 2.9033 1.1204 1.4332 2.7106 1.1144 3.7162 4.9859 3.0794 3.2000 3.0009 4.0167 4.1483 4.7410 3.2334 3.1727 3.3923 3.9669 2.6572 5.8871 6.6749 4.9184 3.7832 3.4670 3.8586 4.5402 3.2264 3.0714 3.3802 5.0812 4.8715 5.7593 4.7678 4.2522 4.7694 7.4846 6.8097 7.1518 6.1210 7.2793 6.5152 2.3341 2.3197 2.4422 1.5453 1.5470 1.5068 4.5338 4.5891 4.6398 1.3721 1.4494 2.2437 2.4428 1.4911 2.5207 1.3264 1.3261 1.3237 1.4360 1.4386 1.4843 1.4290 1.4294 1.4369 2.0005 1.8945 1.6910 1.6366 1.6834 2.0338 1.8287 1.8501 1.8404 1.3617 1.3570 1.2526 3.2378 3.2283 3.9983 2.1942 2.1809 2.1500 1.9883 2.0370 2.1299 6.5669 6.3536 6.4276 1.2583 1.2543 1.2697 1.2321 1.2234 1.2018 1.7784 1.8557 2.2295 1.6809 1.2517 1.6145 2.5844 1.0797 1.1039 1.3468 1.2979 1.4054 1.1994 1.2079 1.1257 1.0936 1.0532 1.1233 6.0223 6.3171 6.2772 6.9827 6.6316 6.6773 1.0376 1.0377 1.0401 1.0399 1.0373 1.0388 1.0970 1.0966 1.0968 1.0966 1.0974 1.0958 1.0987 1.0983 1.0984 1.0982 1.0964 1.0951 1.0862 1.0865 1.0863 1.0919 1.0914 1.0913 1.0996 1.0997 1.0996
irintensity: 0.4100 0.0365 0.2219 0.1447 0.1254 0.2488 0.6298 0.0631 0.2896 0.2198 0.0363 0.1409 0.2589 0.0442 0.1711 1.0062 1.7085 0.7167 1.2067 1.5722 0.8703 1.2636 2.3597 0.5601 9.4187 20.7080 1.8452 0.8436 1.6919 3.6780 4.4090 0.4513 17.0406 15.7945 31.8644 6.7837 3.8177 1.1809 2.8230 2.3533 0.2678 5.1835 23.6214 23.4688 9.1228 6.0151 5.0513 0.9653 65.4909 34.0144 15.8052 67.8209 224.1941 26.4120 0.9677 23.1988 9.5850 24.6280 74.2556 73.7929 13.7748 9.1679 7.6540 2.7248 5.6538 118.5848 67.9232 34.7575 7.7691 0.5887 0.4558 0.3111 8.3166 7.7229 2.7858 8.4762 10.8271 14.6394 91.7216 189.5577 21.1628 10.9738 49.7246 28.1464 53.5841 46.6013 12.0691 42.1912 48.5656 2.1180 32.6056 40.2175 2.2553 52.3171 80.9176 21.4846 7.3683 25.9955 2.0839 0.3974 1.4219 1.4833 5.3329 4.5380 7.1405 26.5281 3.9183 34.1313 45.5829 46.7199 23.7450 2.2576 19.2970 14.4082 17.6362 6.0164 10.9913 34.9953 9.9180 13.2330 46.7401 24.8719 9.7400 36.8251 21.1154 45.3938 83.4572 48.7525 11.9833 8.3073 8.3955 10.3450 43.3279 47.3642 17.8269 12.9522 29.9216 13.4739 34.8841 43.0560 2.9663 1.6327 19.0580 7.1362 24.9503 25.2888 24.1112 19.8589 5.9554 6.9609 5.2126 6.1946 3.7155 16.5810 35.9972 24.2590 16.5078 16.5526 19.4929
temp: 298.150 k
press: 1.00000 atm
elementType: 15 8 8 8 6 6 6 6 6 6 6 6 6 6 6 6 6 6 6 6 6 6 6 6 6 6 6 6 1 1 1 1 1 1 1 1 1 1 1 1 1 1 1 1 1 1 1 1 1 1 1 1 1 1 1
symmnumber: 1
zpe: 1158816.2 jmol-1
zpe.correction: 0.441370 hartree
zpe.thermalcorrener: 0.470679 hartree
zpe.thermalcorrenthalpy: 0.471623 hartree
zpe.thermalcorrgfe: 0.377229 hartree
zpe.sumelectzpe: -1495.650937 hartree
zpe.sumelectthermal: -1495.621628 hartree
zpe.sumelectthermalent: -1495.620684 hartree
zpe.sumelectthermalfe: -1495.715077 hartree
dipole: -0.4818 2.5462 0.0728
dipole: 2.5925
quadrupole: -149.9397 -175.9466 -161.4000
quadrupole: -1.6807 -3.0468 0.6107
quadrupole: 12.4891 -13.5178 1.0287 -1.6807 -3.0468 0.6107
hfenergy: -1496.0923067 hartree
pointgroup: C01 [X(C24H27O3P1)]
dipole: 0.5457539 0.8347002 -0.2138367 debye
polarizability: 364.6088016|-49.1407782|275.9886531|-21.9751053|4.8573042|264.6662987 unknown
InChI: InChI=1S/C24H27O3P/c1-16-10-7-13-22(19(16)4)25-28(26-23-14-8-11-17(2)20(23)5)27-24-15-9-12-18(3)21(24)6/h7-15H,1-6H3
charge 0 multiplicity 1
55 atoms
P  -0.173763 -0.741376 1.03608
O  -1.754849 -1.463771 0.713425
O  -0.003829 0.296289 -0.432028
O  0.597815 -2.187956 0.38347
C  -3.577764 -0.426854 -0.51648
C  1.299727 2.294631 -0.925931
C  2.755983 -2.695439 -0.605192
C  -4.784746 0.335957 -0.506061
C  1.453667 3.711254 -0.83409
C  4.14488 -2.985731 -0.439715
C  -2.921606 -0.641632 0.72448
C  0.175389 1.702879 -0.289872
C  1.998629 -2.391909 0.556273
C  -5.277947 0.847063 0.723119
C  0.501221 4.478983 -0.118372
C  4.722914 -2.950576 0.853549
C  -3.413859 -0.143464 1.94958
C  -0.783326 2.469817 0.412743
C  2.570552 -2.365246 1.849097
C  -2.964587 -1.000304 -1.779031
C  2.301907 1.443838 -1.681335
C  2.099848 -2.722919 -1.971372
C  -4.605077 0.612827 1.942445
C  -0.609825 3.866077 0.501777
C  3.945518 -2.640863 1.99159
C  -5.548279 0.613453 -1.791227
C  2.637454 4.393793 -1.49669
C  5.000125 -3.327958 -1.646847
H  -6.204167 1.433422 0.720423
H  0.63152 5.565336 -0.052334
H  5.789957 -3.173311 0.968172
H  -2.881793 -0.363886 2.881148
H  -1.658946 1.982115 0.8565
H  1.944148 -2.154576 2.72275
H  -1.986972 -0.524036 -1.980509
H  -2.761992 -2.079006 -1.655979
H  -3.61253 -0.858477 -2.657479
H  2.367694 1.752717 -2.742496
H  3.318308 1.545232 -1.25438
H  2.015836 0.382239 -1.649141
H  2.672995 -2.125393 -2.705172
H  2.049774 -3.755841 -2.367727
H  1.073109 -2.331129 -1.918515
H  -5.008571 1.008855 2.880606
H  -1.34435 4.472088 1.04309
H  4.404528 -2.626038 2.986012
H  -4.923924 1.149733 -2.530101
H  -5.889252 -0.32191 -2.273907
H  -6.439908 1.232023 -1.592447
H  2.649933 4.217207 -2.589503
H  2.612325 5.483919 -1.3300
H  3.599798 4.012519 -1.104085
H  5.036511 -2.490597 -2.370376
H  6.035914 -3.561232 -1.347523
H  4.598185 -4.201533 -2.194412
