program: Gaussian 09
title: 000017561
version: EM64L-G09RevD.01
frameworkgroup: C1[X(C15H12N2O2)]
method: RPBEPBE
basis: SDD
operation: Freq
keyword: #p
keyword: freq=noraman
keyword: PBEPBE/SDD
title: #p freq=noraman PBEPBE/SDD
converged: NO YES NO NO
title: Mulliken charges:
elementType: O O N N C C C C C C C C C C C C C C C H H H H H H H H H H H H
charge: -0.210307 -0.210315 -0.245049 -0.245140 -0.621584 0.167963 0.167966 0.456950 0.457019 -0.374720 -0.374705 -0.345661 -0.345708 -0.212234 -0.212237 -0.205409 -0.205385 -0.247643 -0.247634 0.289568 0.289567 0.277653 0.277646 0.264347 0.264330 0.231616 0.231620 0.231164 0.231164 0.232579 0.232579
chargesum: 0.00000
title: Mulliken charges with hydrogens summed into heavy atoms:
elementType: O O N N C C C C C C C C C C C C C C C
charge: -0.210307 -0.210315 -0.245049 -0.245140 -0.042448 0.167963 0.167966 0.456950 0.457019 -0.097067 -0.097060 -0.081314 -0.081378 0.019382 0.019382 0.025755 0.025779 -0.015064 -0.015055
polarizability: 2.03427076e+02 -7.86773244e-03 2.04313175e+02 -2.38160913e+01 -2.48568556e-03 1.24054739e+02
1716.lowfreq: -18.3548 -12.5663 -0.0007 -0.0004 0.0005 3.9944 39.5879 52.6690 58.0222
frequency: 39.5842 52.6580 57.9905 69.0926 78.5135 118.9996 133.1363 211.2196 243.5091 262.4882 286.9663 329.8751 372.2310 387.3150 405.5469 406.2651 471.8513 478.0687 504.5866 518.4599 565.9393 589.8780 606.5945 611.2077 612.9466 659.3718 684.6391 695.5084 696.9821 759.1684 762.0228 837.5643 837.6819 853.0071 911.0258 912.6553 935.0066 940.3964 959.7010 970.2975 970.7662 987.3768 988.3069 992.6007 992.9072 1025.9250 1026.3649 1071.9105 1087.2327 1108.2293 1131.1379 1148.3325 1174.7892 1174.9170 1191.1674 1191.2496 1214.5191 1244.9565 1288.8569 1291.5727 1323.9710 1338.4271 1382.4982 1384.8029 1409.3203 1442.0775 1447.1841 1478.4504 1481.5115 1591.7492 1594.0896 1603.3451 1607.2327 1644.9832 1671.2300 3034.9367 3090.8627 3133.9370 3134.0508 3145.2718 3145.3098 3161.6640 3161.9380 3173.9365 3174.0958 3191.1510 3191.2465
redmass: 7.8306 3.9078 4.2003 5.3594 6.3523 3.1240 4.9468 5.3235 5.4936 4.9826 8.1865 6.9381 6.2613 9.2080 2.8829 2.8886 5.5586 2.6139 4.1169 3.0046 4.9493 9.4302 5.3893 5.9318 6.3696 5.0973 4.2098 2.0004 2.5008 1.6919 1.6278 1.2473 1.2502 7.2257 1.4220 1.3876 6.6336 2.7144 4.2942 1.4079 1.3794 5.9757 5.6758 1.3134 1.3222 2.2022 2.2434 2.3681 1.6697 2.2277 1.2743 4.3266 1.0497 1.0531 1.1158 1.1414 6.7572 1.5478 6.0466 3.1000 1.3319 1.5471 8.5749 10.2442 1.0754 2.3036 2.3461 2.2686 2.2709 6.3870 6.5829 6.0415 5.9396 11.8504 12.6090 1.0620 1.0998 1.0854 1.0854 1.0900 1.0900 1.0950 1.0948 1.0979 1.0978 1.0963 1.0963
irintensity: 1.1778 0.4852 0.5705 0.0708 0.2988 14.4612 2.4819 1.3025 3.6449 0.9829 8.5480 4.7005 1.0464 0.1147 1.2955 0.9459 11.6590 12.5816 9.4323 3.9450 12.3323 12.4952 3.2418 1.0707 0.0837 9.3482 0.2648 65.3955 20.3195 94.5959 46.4291 0.1128 1.4890 0.7385 3.9572 1.8145 11.4051 10.5785 5.9435 0.4138 0.2312 0.1625 0.0016 0.0403 0.6074 11.7618 8.4288 0.6898 11.1529 0.2245 0.0815 15.8018 0.0003 0.3228 1.5615 0.0300 209.7556 2.1904 387.6766 14.7313 0.4552 1.9258 2.8532 0.6402 21.3357 5.8162 14.9421 52.6064 91.2431 3.2501 7.4335 10.1365 54.3504 382.9926 249.0288 0.5017 0.1493 0.1873 0.0319 21.4439 4.5927 38.7371 19.9795 7.2078 7.9791 0.7562 1.1705
temp: 298.150 k
press: 1.00000 atm
elementType: 8 8 7 7 6 6 6 6 6 6 6 6 6 6 6 6 6 6 6 1 1 1 1 1 1 1 1 1 1 1 1
symmnumber: 1
zpe: 617705.8 jmol-1
zpe.correction: 0.235272 hartree
zpe.thermalcorrener: 0.250606 hartree
zpe.thermalcorrenthalpy: 0.251550 hartree
zpe.thermalcorrgfe: 0.191638 hartree
zpe.sumelectzpe: -837.416304 hartree
zpe.sumelectthermal: -837.400969 hartree
zpe.sumelectthermalent: -837.400025 hartree
zpe.sumelectthermalfe: -837.459937 hartree
dipole: 0.0006 -3.2791 0.0001
dipole: 3.2791
quadrupole: -115.1260 -106.1200 -104.2965
quadrupole: -0.0036 -0.1967 0.0011
quadrupole: -6.6118 2.3942 4.2177 -0.0036 -0.1967 0.0011
hfenergy: -837.6515756 hartree
pointgroup: C01 [X(C15H12N2O2)]
dipole: -0.0019379 -1.2900781 0.0003257 debye
polarizability: 203.961597|0.0020748|204.3131655|-22.9018557|0.010499|123.5202267 unknown
InChI: InChI=1S/C15H12N2O2/c18-14-11-15(19)17(13-9-5-2-6-10-13)16(14)12-7-3-1-4-8-12/h1-10H,11H2
charge 0 multiplicity 1
31 atoms
O  2.345407 2.614015 -0.646048
O  -2.338075 2.621033 0.644506
N  0.696565 0.965256 -0.204095
N  -0.694072 0.967346 0.202843
C  0.004524 3.216459 -0.000908
C  1.168531 2.296028 -0.349268
C  -1.162154 2.299502 0.347719
C  1.536924 -0.169174 0.083662
C  -1.537761 -0.164818 -0.08416
C  2.695607 -0.373514 -0.706305
C  -2.696727 -0.365461 0.706354
C  1.228789 -1.047152 1.152497
C  -1.232539 -1.044239 -1.152653
C  3.548787 -1.458806 -0.412084
C  -3.5532 -1.448377 0.412951
C  2.083982 -2.135876 1.42271
C  -2.091051 -2.130561 -1.422063
C  3.246821 -2.346723 0.646081
C  -3.25424 -2.337627 -0.644942
H  0.284183 3.873451 0.840727
H  -0.273241 3.873967 -0.84277
H  2.929163 0.317249 -1.519252
H  -2.927925 0.326282 1.519129
H  0.336899 -0.881466 1.763041
H  -0.340372 -0.881416 -1.76357
H  4.448167 -1.611498 -1.01814
H  -4.452778 -1.598197 1.019424
H  1.84255 -2.816241 2.246429
H  -1.851905 -2.81201 -2.245552
H  3.908321 -3.192282 0.862456
H  -3.918282 -3.181348 -0.86072
