program: Gaussian 09
title: 000190383
version: EM64L-G09RevD.01
frameworkgroup: C1[X(C17H21NO)]
method: RPBEPBE
basis: SDD
operation: Freq
keyword: #p
keyword: freq=noraman
keyword: PBEPBE/SDD
title: #p freq=noraman PBEPBE/SDD
converged: YES YES NO NO
title: Mulliken charges:
elementType: O N C C C C C C C C C C C C C C C C C H H H H H H H H H H H H H H H H H H H H H
charge: -0.250882 -0.289724 -0.145557 0.166121 -0.374970 0.380223 -0.400341 0.202118 -0.711969 0.403605 -0.358449 -0.704082 -0.662195 -0.355470 -0.462280 -0.244558 -0.428650 -0.264045 -0.241830 0.206699 0.233894 0.190379 0.226190 0.245648 0.203900 0.243873 0.219264 0.245930 0.217088 0.192895 0.237635 0.236376 0.218411 0.218469 0.244651 0.239866 0.228024 0.237788 0.227201 0.228756
chargesum: 0.00000
title: Mulliken charges with hydrogens summed into heavy atoms:
elementType: O N C C C C C C C C C C C C C C C C C
charge: -0.250882 -0.289724 0.061141 0.166121 0.049303 0.380223 0.071496 0.202118 -0.044933 0.403605 -0.112518 -0.056464 0.011061 -0.110818 -0.222415 -0.016534 -0.190862 -0.036844 -0.013074
polarizability: 2.40751831e+02 -1.17914230e+01 2.10775514e+02 -6.74358874e+00 -7.29963559e+00 1.31388971e+02
1716.lowfreq: -10.6389 -5.3478 -0.0009 -0.0007 -0.0005 6.2826 19.3257 33.8979 42.0229
frequency: 19.0824 33.8333 42.0068 64.7400 88.7379 90.3520 106.9213 152.4742 175.1946 178.0169 200.3692 208.2563 216.3529 232.5679 245.3029 265.0759 304.9181 336.0714 379.8409 392.7538 421.3900 431.6481 472.2649 479.9776 507.3712 537.0961 550.8964 585.9204 605.1099 656.5146 676.2207 706.1116 731.0359 748.7304 784.3943 784.8995 793.1572 802.2860 814.4557 840.0681 878.4586 887.2926 917.1142 949.2486 963.5698 964.8031 983.7226 994.1827 1001.5903 1015.4140 1026.4120 1030.0303 1066.8563 1079.5448 1091.7181 1095.1456 1104.9817 1137.2054 1152.8168 1170.0663 1172.9807 1185.9338 1230.7641 1235.1806 1247.3442 1262.5087 1267.9419 1277.0446 1322.9802 1335.1303 1345.0420 1367.9371 1377.1524 1384.8063 1386.9837 1395.0324 1404.2585 1418.1649 1438.2858 1454.7139 1456.2028 1466.5569 1470.4190 1476.6942 1479.4732 1481.1244 1487.1503 1492.2072 1513.7244 1577.9417 1590.1307 1599.2808 1634.5310 2970.1882 2975.2708 2982.6539 2985.6829 3003.2284 3013.5029 3045.6514 3062.2636 3067.8063 3069.0199 3079.1171 3081.0458 3085.4110 3093.1634 3122.0840 3126.0048 3132.3336 3145.3349 3147.9333 3162.9969 3164.7432
redmass: 4.1874 4.3058 3.4515 4.1206 3.3819 2.8332 2.5931 3.4589 2.8989 4.0114 1.4310 1.0874 1.6519 1.6388 3.1534 2.3636 2.7666 2.7708 3.1872 3.5971 3.0851 3.1272 3.2673 5.6222 6.4476 3.6147 6.0963 4.0300 3.3557 2.9949 3.7341 5.6501 2.4185 1.4115 2.0754 2.9363 1.4181 1.3489 1.6596 2.5313 1.6736 2.5652 1.4758 2.1777 1.3151 1.3486 1.3749 1.3413 1.9804 2.7459 2.2373 2.7991 2.2705 2.0785 1.8832 1.7500 2.1588 1.9645 1.5514 1.1699 1.8209 1.5044 2.0744 1.8417 1.6888 1.2902 1.8052 1.2963 1.4047 1.4633 1.2853 2.0874 1.5787 1.2301 1.2292 1.6654 2.8395 4.5734 2.7644 1.1094 2.4703 1.0481 1.0496 1.0496 1.0474 1.0624 1.0521 1.0856 3.9479 8.1200 7.3130 5.8408 6.8794 1.0368 1.0353 1.0353 1.0628 1.0816 1.0625 1.0972 1.1014 1.0992 1.0989 1.1005 1.0993 1.1003 1.1019 1.0859 1.0868 1.0882 1.0925 1.0945 1.1003 1.0988
irintensity: 0.1008 1.3517 0.6425 1.3021 0.0237 0.7130 0.4874 1.4901 0.5903 2.4430 1.4587 0.8450 0.5247 1.5810 1.4159 1.5741 7.0831 3.6941 8.9201 2.1905 0.2951 5.6516 0.1554 1.7658 0.8347 11.8070 2.2230 2.1068 1.9010 0.4923 2.6453 4.6528 2.8292 1.5152 49.0366 6.5570 48.0684 7.8889 47.9027 1.7368 3.8138 1.7351 1.5478 7.9293 2.8138 14.2479 1.6070 0.5028 13.9531 20.3502 3.1094 3.0141 4.8898 7.2731 16.4165 48.6558 22.7874 10.2164 5.8345 1.6094 3.6892 3.8984 60.9138 5.3627 20.9426 35.7581 17.3863 1.5933 15.2475 7.9250 4.3640 3.5733 44.3100 10.6309 32.7785 90.6175 34.9886 1.9215 6.9197 20.1888 11.2648 2.1074 13.2202 14.8284 1.1645 19.7169 19.0848 9.7365 11.7279 135.2670 40.9963 26.1923 2.0485 35.8546 22.3632 24.8751 47.5933 18.5304 20.6650 2.4113 6.4677 42.5040 58.8364 56.2329 31.6871 38.4673 50.6761 1.2417 1.8174 4.5242 14.1810 44.2924 44.0575 4.0391
temp: 298.150 k
press: 1.00000 atm
elementType: 8 7 6 6 6 6 6 6 6 6 6 6 6 6 6 6 6 6 6 1 1 1 1 1 1 1 1 1 1 1 1 1 1 1 1 1 1 1 1 1
symmnumber: 1
zpe: 884779.9 jmol-1
zpe.correction: 0.336995 hartree
zpe.thermalcorrener: 0.355858 hartree
zpe.thermalcorrenthalpy: 0.356802 hartree
zpe.thermalcorrgfe: 0.288857 hartree
zpe.sumelectzpe: -789.003069 hartree
zpe.sumelectthermal: -788.984207 hartree
zpe.sumelectthermalent: -788.983263 hartree
zpe.sumelectthermalfe: -789.051207 hartree
dipole: 0.3549 -0.6689 3.6807
dipole: 3.7577
quadrupole: -101.6272 -104.0155 -121.3006
quadrupole: 2.4385 -6.4055 -0.9308
quadrupole: 7.3539 4.9656 -12.3195 2.4385 -6.4055 -0.9308
hfenergy: -789.3400644 hartree
pointgroup: C01 [X(C17H21N1O1)]
dipole: 0.0964961 -0.0407086 -1.4746973 debye
polarizability: 240.6378097|12.6448818|204.7040609|1.3575588|-23.0858378|137.5744456 unknown
InChI: InChI=1S/C17H21NO/c1-4-13(3)17(19)18(5-2)16-12-8-10-14-9-6-7-11-15(14)16/h6-13H,4-5H2,1-3H3
charge 0 multiplicity 1
40 atoms
O  -1.59784 0.133273 1.747908
N  -0.874211 -0.097844 -0.452764
C  -3.186669 0.816037 0.012572
C  -1.84096 0.240281 0.507095
C  -4.334042 0.371247 0.954882
C  0.39797 -0.642648 -0.008986
C  -1.092523 -0.060474 -1.926292
C  1.587451 0.1660 -0.099306
C  -3.068285 2.365239 -0.033281
C  2.857693 -0.423056 0.277543
C  0.465997 -1.951002 0.475147
C  -4.615787 -1.145417 0.90558
C  -1.681721 -1.373196 -2.485073
C  1.559991 1.53297 -0.532539
C  2.892536 -1.773263 0.757904
C  1.716946 -2.518181 0.866909
C  4.049293 0.369692 0.175489
C  2.73679 2.280399 -0.615172
C  3.994661 1.69255 -0.266949
H  -3.417772 0.444704 -1.003642
H  -4.065599 0.662603 1.986994
H  -5.247862 0.932869 0.675117
H  -1.739824 0.79649 -2.180879
H  -0.111862 0.133656 -2.396624
H  -2.27684 2.701594 -0.729435
H  -2.824294 2.754555 0.971388
H  -4.024436 2.814912 -0.357922
H  -0.455066 -2.535915 0.563401
H  -5.462902 -1.412013 1.563581
H  -4.86969 -1.47762 -0.120261
H  -3.734596 -1.717317 1.248655
H  -1.021764 -2.226011 -2.247443
H  -2.678592 -1.578166 -2.05469
H  -1.78413 -1.312325 -3.584456
H  0.594498 1.991459 -0.771272
H  3.856377 -2.209174 1.046386
H  1.745406 -3.54482 1.247212
H  5.007875 -0.081279 0.459191
H  2.701099 3.326811 -0.937899
H  4.910484 2.289479 -0.338272
