program: Gaussian 09
title: 000190356
version: EM64L-G09RevD.01
frameworkgroup: C1[X(C27H16ClN)]
method: RPBEPBE
basis: SDD
operation: Freq
keyword: #p
keyword: freq=noraman
keyword: PBEPBE/SDD
title: #p freq=noraman PBEPBE/SDD
converged: YES YES NO NO
title: Mulliken charges:
elementType: Cl N C C C C C C C C C C C C C C C C C C C C C C C C C C C H H H H H H H H H H H H H H H H
charge: -0.035678 -0.022875 0.183683 0.243432 0.248392 -0.267494 -0.117957 0.196985 0.262113 0.420094 0.274285 0.427455 -0.359141 -0.365483 -0.515551 -0.494525 -0.328981 -0.390494 -0.468304 -0.438498 -0.311425 -0.344672 -0.290462 -0.253145 -0.242175 -0.242094 -0.229652 -0.237626 -0.229796 0.249064 0.267783 0.234820 0.242475 0.250828 0.286675 0.242514 0.241581 0.261893 0.230508 0.231299 0.229968 0.228229 0.259840 0.236668 0.235441
chargesum: 0.00000
title: Mulliken charges with hydrogens summed into heavy atoms:
elementType: Cl N C C C C C C C C C C C C C C C C C C C C C C C C C C C
charge: -0.035678 -0.022875 0.183683 0.243432 0.248392 -0.267494 -0.117957 0.196985 0.262113 0.420094 0.274285 0.427455 -0.110077 -0.097699 -0.280731 -0.252051 -0.078152 -0.103819 -0.225789 -0.196917 -0.311425 -0.082780 -0.059954 -0.021846 -0.012207 -0.013865 0.030189 -0.000958 0.005646
polarizability: 5.37218977e+02 1.59152379e+01 3.46588761e+02 8.99974804e+00 -1.46206085e+01 1.69697743e+02
1716.lowfreq: -4.8353 -1.6423 -0.0023 -0.0014 -0.0012 6.5928 16.1715 35.5885 43.3050
frequency: 15.6260 35.5515 43.2803 59.0927 62.5752 103.6993 113.1278 124.8721 147.0389 175.0216 198.7964 211.5421 215.1834 239.5454 286.7811 295.6903 325.7987 333.1139 363.0309 397.5972 413.4986 424.3955 433.0546 444.2492 462.8386 482.1264 500.0287 505.7397 519.8249 533.0640 535.5754 552.4562 583.3298 594.9546 613.6080 641.6893 650.1751 655.9744 682.5159 684.0695 718.8193 741.3321 742.9775 753.4826 756.8556 763.0653 769.4065 782.9215 806.6363 824.5786 825.2606 841.8899 859.6096 872.2378 878.3467 890.1646 896.1268 900.9329 933.7940 953.9808 962.7972 971.4892 987.5929 989.2038 990.9443 998.7758 1006.1867 1016.2046 1023.5062 1031.9605 1044.6814 1066.8896 1093.8102 1103.2855 1122.2101 1149.2088 1155.5485 1169.3501 1170.3633 1172.4944 1183.9681 1224.9117 1229.7438 1242.0425 1245.6377 1263.1934 1266.2744 1293.0866 1304.6678 1331.9542 1352.3622 1359.9597 1364.5005 1392.1955 1406.5321 1413.9361 1418.2839 1428.1985 1440.5801 1451.0723 1458.9376 1477.0257 1487.0288 1508.5667 1527.9494 1549.3102 1562.6146 1564.9717 1600.9323 1608.8786 1615.2290 1623.9779 1631.8587 3122.1784 3122.2995 3127.0467 3130.0910 3136.4584 3136.6299 3137.0041 3147.9958 3155.6631 3159.9232 3163.1374 3163.3667 3170.3805 3172.1179 3176.2565 3228.2939
redmass: 6.2469 6.3715 6.5972 5.0448 4.8883 8.1932 4.6726 5.4084 4.5537 4.9993 5.2871 4.7472 6.0396 5.4497 4.9034 4.9017 5.6747 5.6613 6.1050 5.3249 3.8625 5.8597 3.3173 4.2622 4.5673 6.7341 3.9111 5.3803 6.2856 3.6818 4.7373 3.7424 3.3640 5.0353 7.5545 6.6050 6.4676 5.3280 7.2226 3.6103 5.1126 2.7963 6.2627 5.8297 1.5327 1.3092 1.3345 2.9568 2.9548 2.2753 3.7188 1.6161 2.8860 1.5299 4.3822 1.6911 4.6626 1.6850 6.1270 1.4101 1.3894 1.3534 1.3759 1.3333 1.3439 1.3709 1.3459 6.4760 3.0592 2.3751 2.5090 2.7102 2.4199 2.2684 1.6827 1.3104 1.3683 1.3122 1.2352 1.0810 1.2833 1.8532 1.9943 1.9690 1.7727 1.6859 1.8002 2.0959 4.2391 2.8559 5.9369 4.0329 4.7453 6.0402 4.0540 2.5593 2.2494 2.5818 3.3123 3.0685 2.6314 3.6201 3.6335 4.0142 7.2501 6.0915 7.3550 6.1065 7.1272 6.3571 6.1256 6.8222 7.1842 1.0865 1.0870 1.0880 1.0888 1.0903 1.0905 1.0861 1.0907 1.0960 1.0992 1.0954 1.0950 1.0969 1.0973 1.0999 1.0905
irintensity: 0.1641 0.2597 0.7538 0.4618 0.3016 0.4094 0.0252 0.1641 0.0403 1.4416 1.6167 3.1388 0.0580 0.3291 0.3677 0.4463 0.4701 0.1676 1.6566 0.7609 5.3311 9.2875 1.5947 1.5862 2.7995 5.0681 1.5712 1.2333 1.1120 10.3661 4.9156 0.4820 3.2573 6.4093 5.8393 1.5898 11.6663 7.7139 13.1217 13.9854 0.1695 0.8911 6.4777 4.4721 49.5914 46.6322 29.4203 11.7094 0.4935 7.9697 3.8843 96.4430 1.2683 0.0370 7.0609 24.1379 5.5640 0.9420 1.6118 1.1393 1.2962 0.9181 4.9466 0.0405 0.3433 0.7873 0.4345 36.8272 18.5961 6.2162 6.9770 0.8726 4.1773 0.5066 2.7302 2.4584 5.3410 10.4260 3.6718 1.9453 0.0873 4.8775 4.8635 4.1286 1.3095 3.4093 3.4929 1.5676 5.3815 2.9404 4.8801 4.4427 30.1813 0.3034 3.2781 7.4368 20.4203 1.8546 49.8355 2.0111 13.7746 6.8438 22.4710 19.4132 28.9238 0.1569 4.7603 7.3713 0.8372 0.6057 5.8292 1.2613 1.3831 1.6222 1.5855 5.4626 7.7006 16.8020 17.2275 2.0323 9.1159 39.0622 45.7126 9.9831 20.1553 14.9811 26.0162 14.5141 5.9310
temp: 298.150 k
press: 1.00000 atm
elementType: 17 7 6 6 6 6 6 6 6 6 6 6 6 6 6 6 6 6 6 6 6 6 6 6 6 6 6 6 6 1 1 1 1 1 1 1 1 1 1 1 1 1 1 1 1
symmnumber: 1
zpe: 895274.9 jmol-1
zpe.correction: 0.340992 hartree
zpe.thermalcorrener: 0.362205 hartree
zpe.thermalcorrenthalpy: 0.363149 hartree
zpe.thermalcorrgfe: 0.289844 hartree
zpe.sumelectzpe: -1551.425310 hartree
zpe.sumelectthermal: -1551.404097 hartree
zpe.sumelectthermalent: -1551.403153 hartree
zpe.sumelectthermalfe: -1551.476458 hartree
dipole: -1.6976 2.2475 -1.8159
dipole: 3.3512
quadrupole: -149.3966 -149.2543 -178.3917
quadrupole: -0.5133 2.7197 -4.8765
quadrupole: 9.6176 9.7599 -19.3775 -0.5133 2.7197 -4.8765
hfenergy: -1551.7663022 hartree
pointgroup: C01 [X(C27H16Cl1N1)]
dipole: 0.6459024 0.941596 0.6592315 debye
polarizability: 538.1203447|-9.6232069|346.9005123|6.3226753|5.2784166|168.4846246 unknown
InChI: InChI=1S/C27H16ClN/c28-23-12-6-5-11-21(23)25-22-15-13-18-8-2-4-10-20(18)27(22)29-24-16-14-17-7-1-3-9-19(17)26(24)25/h1-16H
charge 0 multiplicity 1
45 atoms
Cl 0.982817 1.923041 -2.61925
N  -1.310192 -1.911932 0.041924
C  0.958625 -0.857581 0.055076
C  0.33028 0.429804 0.082736
C  -1.101041 0.529916 0.07493
C  -1.890426 -0.681159 0.041644
C  0.053567 -2.00555 0.053717
C  2.413759 -1.130835 0.0334
C  -3.353028 -0.607548 0.02029
C  2.869525 -2.504959 0.066547
C  1.06977 1.734741 0.178233
C  -3.991769 0.679396 0.039289
C  -1.793256 1.804004 0.099746
C  0.569109 -3.355827 0.07646
C  -3.172609 1.872037 0.08149
C  1.921962 -3.597253 0.094047
C  3.428825 -0.124479 -0.035259
C  -4.154306 -1.784422 -0.018598
C  4.264395 -2.806973 0.056539
C  -5.417449 0.751804 0.017463
C  1.384302 2.532595 -0.947783
C  1.402291 2.261182 1.456071
C  4.796217 -0.441868 -0.049548
C  5.227626 -1.793168 0.003003
C  -5.554148 -1.69207 -0.039783
C  -6.190867 -0.417009 -0.021917
C  2.021834 3.784449 -0.837542
C  2.041372 3.511903 1.594183
C  2.354067 4.27553 0.445441
H  -1.206731 2.726418 0.129743
H  -0.17381 -4.15813 0.082768
H  -3.673402 2.847481 0.096276
H  2.309308 -4.62249 0.117989
H  3.156526 0.927098 -0.084408
H  -3.643086 -2.751004 -0.031956
H  4.569583 -3.859809 0.085654
H  -5.900707 1.735991 0.031321
H  1.156228 1.665882 2.341723
H  5.533247 0.366683 -0.105462
H  6.295461 -2.036361 -0.005804
H  -6.162636 -2.602533 -0.070609
H  -7.28452 -0.353128 -0.03921
H  2.251296 4.360841 -1.738445
H  2.290815 3.888746 2.59142
H  2.849275 5.247547 0.540853
