program: Gaussian 09
title: 000190341
version: EM64L-G09RevD.01
frameworkgroup: C1[X(C19H16)]
method: RPBEPBE
basis: SDD
operation: Freq
keyword: #p
keyword: freq=noraman
keyword: PBEPBE/SDD
title: #p freq=noraman PBEPBE/SDD
converged: YES YES NO NO
title: Mulliken charges:
elementType: C C C C C C C C C C C C C C C C C C C H H H H H H H H H H H H H H H H
charge: -0.254141 0.229546 -0.642600 0.213822 0.362383 0.153486 0.191892 -0.727246 0.426347 -0.427248 -0.434025 -0.518569 -0.377972 -0.393864 -0.441227 -0.246259 -0.262515 -0.266532 -0.250147 0.220548 0.232671 0.223213 0.229342 0.214663 0.239991 0.226675 0.235870 0.236007 0.226669 0.231865 0.241404 0.226319 0.226047 0.225294 0.228291
chargesum: 0.00000
title: Mulliken charges with hydrogens summed into heavy atoms:
elementType: C C C C C C C C C C C C C C C C C C C
charge: -0.033592 0.229546 -0.186716 0.213822 0.362383 0.153486 0.191892 -0.043250 0.426347 -0.200573 -0.198155 -0.282562 -0.151302 -0.161999 -0.199824 -0.019939 -0.036468 -0.041238 -0.021856
polarizability: 3.43594629e+02 1.00571806e+01 2.05190282e+02 1.69867517e+00 9.15314209e+00 9.84877837e+01
1716.lowfreq: -6.4296 -2.6779 -0.0002 0.0003 0.0008 6.9836 50.7823 80.3052 106.0498
frequency: 50.7533 80.2871 106.0439 130.9112 165.2379 194.1417 206.2697 227.3077 277.4187 280.8718 314.5072 362.8800 378.8987 428.9619 434.1801 470.2225 483.3127 496.1091 524.6101 553.9648 560.0791 561.2793 583.5635 654.5339 668.3327 691.2832 713.6585 741.9492 753.3420 771.4443 805.0390 808.4471 826.9903 834.5336 859.0010 872.1991 880.9385 889.3803 923.9637 948.5052 955.4078 973.9447 985.1864 990.3105 995.7343 1010.0054 1033.8833 1043.9801 1063.4790 1082.2253 1114.2097 1132.5784 1158.2962 1174.8050 1178.3704 1189.2020 1215.7107 1223.5511 1237.8288 1257.5397 1262.0305 1290.5062 1297.7678 1301.4939 1345.4455 1371.9288 1383.3740 1387.5311 1405.5767 1408.6426 1431.9726 1441.5841 1451.0765 1464.5730 1471.9408 1480.5746 1487.5696 1520.6157 1563.4452 1588.4377 1604.9443 1612.1446 1629.7617 2958.0196 2976.1280 3011.0223 3030.3390 3071.0859 3084.0350 3115.2128 3119.6224 3123.8132 3128.1805 3130.9820 3142.3091 3149.5342 3155.0874 3161.4917 3163.7310
redmass: 4.8276 3.5845 3.2843 3.8330 3.7736 3.5011 3.6569 1.0899 3.7153 5.5103 2.6313 3.3616 3.8180 3.1000 3.0788 3.8617 3.9810 3.7466 5.2961 5.1652 4.2674 4.7745 3.3545 4.4798 5.7169 3.4770 2.8851 3.0896 1.2686 1.5831 2.5716 3.4782 3.6204 1.6287 4.1620 1.7065 1.7929 2.3058 1.7710 1.4147 1.3530 1.3989 1.3315 1.3447 2.0370 3.0225 2.2151 2.1488 2.7886 2.0353 1.8286 1.6064 1.3887 1.0785 1.1167 1.3843 2.0614 1.4248 1.9545 1.7108 1.4332 2.3874 1.8570 1.4920 2.4954 1.5719 4.6520 1.3459 3.8737 2.7905 3.7480 2.1960 1.1579 2.4260 1.0575 1.0779 2.7195 3.4905 6.9832 7.4409 6.0203 6.4647 6.6837 1.0641 1.0355 1.0840 1.0964 1.0992 1.1000 1.0870 1.0863 1.0871 1.0877 1.0884 1.0938 1.0939 1.0956 1.0999 1.0996
irintensity: 0.1953 0.0438 0.8105 0.0941 0.4915 1.2604 0.2898 0.2857 3.7947 0.2419 0.8646 1.0794 0.1296 1.5442 10.7724 3.3754 4.0457 0.9321 0.1282 3.2958 2.0222 2.6782 4.9516 3.0339 0.9098 0.4351 8.7953 9.4420 2.7492 128.4206 4.4084 0.3893 0.3032 43.0815 0.4416 1.6898 8.5648 6.1149 1.5451 1.8739 1.2327 2.4587 0.1189 0.4745 6.9652 1.0025 12.0767 4.4383 7.6935 5.2600 1.6926 0.4922 2.6525 2.8849 0.1124 0.7623 0.7586 10.3390 2.1715 7.7302 0.9767 0.4041 0.3461 5.6926 2.0754 8.3861 3.1551 17.5958 7.3370 0.7928 4.4172 2.4293 12.2317 5.8690 9.3278 5.2590 28.6774 4.2475 0.7691 0.1150 3.6108 0.7127 3.7488 27.2290 31.7890 26.5161 27.7264 36.0602 24.9244 9.9230 1.9398 8.5536 6.8332 9.8385 22.7677 32.2420 24.7204 52.1477 28.0710
temp: 298.150 k
press: 1.00000 atm
elementType: 6 6 6 6 6 6 6 6 6 6 6 6 6 6 6 6 6 6 6 1 1 1 1 1 1 1 1 1 1 1 1 1 1 1 1
symmnumber: 1
zpe: 755173.4 jmol-1
zpe.correction: 0.287630 hartree
zpe.thermalcorrener: 0.301971 hartree
zpe.thermalcorrenthalpy: 0.302916 hartree
zpe.thermalcorrgfe: 0.247042 hartree
zpe.sumelectzpe: -732.358553 hartree
zpe.sumelectthermal: -732.344212 hartree
zpe.sumelectthermalent: -732.343268 hartree
zpe.sumelectthermalfe: -732.399141 hartree
dipole: -0.0423 -0.5706 -0.0143
dipole: 0.5724
quadrupole: -99.3501 -98.0676 -117.9043
quadrupole: -0.6592 0.1851 2.7591
quadrupole: 5.7572 7.0397 -12.7969 -0.6592 0.1851 2.7591
hfenergy: -732.6461831 hartree
pointgroup: C01 [X(C19H16)]
dipole: 0.017719 -0.2244216 0.0055985 debye
polarizability: 343.680418|-9.3649649|205.1002124|2.270709|-9.139422|98.4920638 unknown
InChI: InChI=1S/C19H16/c1-13-12-15-7-3-4-8-16(15)18-11-10-14-6-2-5-9-17(14)19(13)18/h2-11,13H,12H2,1H3
charge 0 multiplicity 1
35 atoms
C  -0.166506 -1.838239 0.083116
C  0.459207 -0.440259 0.090287
C  -1.488278 -1.831884 0.891069
C  -0.392855 0.689788 0.067756
C  -2.43233 -0.740688 0.420941
C  -1.871248 0.512087 0.027952
C  1.893002 -0.264928 0.064353
C  -0.377073 -2.339498 -1.373115
C  2.450056 1.075065 0.049253
C  0.182598 2.007754 0.06796
C  -3.831295 -0.926858 0.390738
C  1.559263 2.196961 0.062867
C  -2.748827 1.545258 -0.399923
C  2.814526 -1.369167 0.037646
C  3.871028 1.256971 0.026547
C  -4.695096 0.113185 -0.021229
C  -4.145999 1.353061 -0.421809
C  4.196275 -1.16375 0.008379
C  4.735074 0.160703 0.006176
H  0.515361 -2.54518 0.590589
H  -1.246734 -1.66631 1.962325
H  -1.977136 -2.82201 0.820172
H  0.576127 -2.343135 -1.931473
H  -0.785113 -3.368088 -1.374037
H  -1.085775 -1.687709 -1.914722
H  -0.477213 2.880528 0.099358
H  -4.247257 -1.895879 0.693636
H  1.980859 3.209075 0.072055
H  -2.342159 2.501639 -0.745528
H  2.434251 -2.395249 0.035118
H  4.269159 2.278911 0.022664
H  -5.779247 -0.044226 -0.039775
H  -4.802433 2.162579 -0.759981
H  4.875781 -2.023247 -0.012766
H  5.820509 0.307541 -0.013102
