program: Gaussian 09
title: 000017547
version: EM64L-G09RevD.01
frameworkgroup: C1[X(C12H27N3O)]
method: RPBEPBE
basis: SDD
operation: Freq
keyword: #p
keyword: freq=noraman
keyword: PBEPBE/SDD
title: #p freq=noraman PBEPBE/SDD
converged: YES YES NO NO
title: Mulliken charges:
elementType: O N N N C C C C C C C C C C C C H H H H H H H H H H H H H H H H H H H H H H H H H H H
charge: -0.239459 -0.102444 -0.381960 -0.503507 -0.373448 -0.352483 -0.423821 -0.381519 0.001173 -0.020591 -0.447009 -0.716856 -0.739616 -0.712530 -0.718206 0.197209 0.216775 0.179893 0.201696 0.190905 0.188310 0.198198 0.220074 0.184383 0.259490 0.190842 0.239783 0.179550 0.209283 0.196219 0.214624 0.212289 0.196873 0.237397 0.218234 0.204913 0.211154 0.211459 0.204419 0.220482 0.317191 0.304145 0.306489
chargesum: 0.00000
title: Mulliken charges with hydrogens summed into heavy atoms:
elementType: O N N N C C C C C C C C C C C C
charge: -0.239459 -0.102444 -0.064769 0.107126 0.023219 0.040118 -0.037313 0.022938 0.260663 0.170250 -0.027676 -0.096730 -0.093056 -0.078229 -0.081847 0.197209
polarizability: 1.65280676e+02 4.79700058e+00 1.64116605e+02 1.74378626e+00 1.27030052e+00 1.40803460e+02
1716.lowfreq: -0.0002 0.0002 0.0005 2.0741 8.8887 11.1785 16.1184 20.6519 28.5958
frequency: 15.9068 20.4037 28.1435 35.9102 44.6047 56.8284 89.5225 100.8258 116.8522 131.5309 155.2576 180.3851 200.5298 208.8460 214.4245 228.0443 235.8669 248.6688 270.5551 290.1774 311.8470 341.6848 357.2774 378.3223 396.4198 404.4736 413.3408 440.1364 477.6844 548.1160 571.6151 628.1616 735.7488 750.6899 772.2592 775.4422 797.2927 824.1689 882.5707 903.6043 917.7919 918.6462 938.2854 938.7167 945.7280 954.2261 955.7582 975.8475 995.2756 1013.5235 1053.2758 1088.9224 1107.2615 1126.8666 1130.7084 1138.6163 1163.2415 1178.0064 1179.5952 1187.1010 1225.8424 1230.6776 1247.3693 1252.9239 1271.2752 1283.7120 1288.6647 1300.5790 1306.1617 1328.4810 1336.5139 1347.4527 1350.5914 1364.5636 1368.9772 1373.2432 1377.0489 1381.5785 1390.9763 1396.8550 1432.2218 1450.6712 1456.6907 1462.0611 1467.2391 1469.3082 1472.4659 1474.2567 1475.3674 1478.6795 1481.8771 1483.1528 1488.2368 1495.1923 1627.7862 1679.6639 2803.9207 2830.8802 2848.0355 2952.9634 2957.0556 2960.3844 2965.5309 2966.2953 2967.3880 2971.2447 2991.5137 3000.7542 3009.0884 3038.5791 3050.6261 3051.2600 3054.3158 3057.4267 3060.6454 3065.4942 3066.1525 3068.1550 3071.9703 3074.3219 3389.1118 3503.0893 3543.7049
redmass: 4.8620 4.3056 3.9192 2.5971 3.8180 2.6573 2.7461 2.4406 1.6372 2.3928 2.1815 2.4079 1.1917 1.3784 1.3503 1.5664 1.2414 2.6229 1.9178 2.6125 2.4410 2.7250 2.6601 2.0988 2.1560 2.4137 2.1455 2.4723 2.5133 1.9856 1.8748 2.2597 3.6360 2.2659 1.7718 1.3660 2.7643 2.4237 1.7954 2.0857 1.1964 1.1814 2.0662 3.2075 1.6937 1.3489 1.4912 1.6882 1.7348 1.9391 3.0251 2.5016 2.2398 2.0801 2.1950 2.3892 2.4275 1.8220 1.8259 2.1509 1.4007 1.7384 1.2977 1.4931 1.4455 1.1959 1.2193 1.3562 1.2421 1.4370 1.4814 1.5166 1.4024 1.3880 1.3319 1.2322 1.3285 1.2695 1.2302 1.2185 1.5937 1.1184 1.0762 1.0665 1.0558 1.0466 1.0570 1.0772 1.0634 1.0738 1.0666 1.0601 1.0502 1.0528 7.7457 1.0645 1.0720 1.0722 1.0696 1.0798 1.0553 1.0386 1.0405 1.0371 1.0508 1.0478 1.0864 1.0857 1.0957 1.1011 1.0980 1.0840 1.0882 1.0993 1.0974 1.0987 1.0988 1.0996 1.0987 1.0978 1.0429 1.0984 1.0794
irintensity: 1.6287 1.0352 0.4456 0.3169 0.8667 0.1112 0.3511 0.3799 16.5418 2.5438 3.9236 2.3532 1.7908 2.0294 2.2663 0.2012 0.8796 7.6670 3.4323 9.4111 3.4077 6.7420 4.4150 0.0460 4.8863 3.4033 0.3290 1.8356 0.5465 88.8944 61.6661 34.4144 2.0323 6.5017 63.1385 63.0424 29.0514 7.1454 0.5598 0.7446 5.0690 3.3100 3.0292 20.7150 12.5915 0.4564 2.2734 3.5488 2.6857 11.2995 3.5558 28.1749 34.7948 3.9815 0.6302 6.0342 29.2137 9.6907 14.8140 15.3099 1.8138 20.7104 13.7274 22.3578 1.4928 0.9350 0.3414 14.6540 0.8215 2.4268 13.8153 1.4680 1.6919 5.4277 7.9138 10.3361 10.8806 16.2843 19.3629 14.4985 126.6030 27.5557 0.5132 1.7976 1.2907 3.8004 4.5805 8.7323 15.2485 0.6979 12.0021 5.0485 29.1506 13.6986 149.2325 27.4779 101.8707 76.8476 183.8670 9.1759 32.9610 64.7451 41.0492 33.2996 31.7759 35.2241 7.2609 26.2983 18.9892 24.3851 6.6719 7.4271 34.5387 5.6030 75.5896 103.9344 62.7207 41.3940 74.3864 44.6208 0.0809 1.5712 24.5031
temp: 298.150 k
press: 1.00000 atm
elementType: 8 7 7 7 6 6 6 6 6 6 6 6 6 6 6 6 1 1 1 1 1 1 1 1 1 1 1 1 1 1 1 1 1 1 1 1 1 1 1 1 1 1 1
symmnumber: 1
zpe: 1005639.5 jmol-1
zpe.correction: 0.383028 hartree
zpe.thermalcorrener: 0.404204 hartree
zpe.thermalcorrenthalpy: 0.405148 hartree
zpe.thermalcorrgfe: 0.330078 hartree
zpe.sumelectzpe: -711.577176 hartree
zpe.sumelectthermal: -711.556000 hartree
zpe.sumelectthermalent: -711.555056 hartree
zpe.sumelectthermalfe: -711.630126 hartree
dipole: 1.3076 0.5183 2.5707
dipole: 2.9304
quadrupole: -103.0195 -100.0049 -101.1891
quadrupole: -1.1935 -4.4157 1.1088
quadrupole: -1.6150 1.3996 0.2154 -1.1935 -4.4157 1.1088
hfenergy: -711.9602044 hartree
pointgroup: C01 [X(C12H27N3O1)]
dipole: -0.4874207 -0.2152222 1.0223814 debye
polarizability: 165.0168283|4.7884494|164.2946715|-2.2656408|-1.3623259|140.8892416 unknown
InChI: InChI=1S/C12H27N3O/c1-10(2)5-7-15(8-6-11(3)4)9-12(16)14-13/h10-11,14H,5-9,13H2,1-4H3
charge 0 multiplicity 1
43 atoms
O  1.292489 -2.092392 -1.239975
N  0.323316 -0.002799 0.765625
N  0.252396 -3.504597 0.281848
N  0.088989 -4.585102 -0.627045
C  0.878781 1.144198 1.526887
C  -1.159219 -0.095098 0.793787
C  2.334546 1.499404 1.141864
C  -1.856644 1.017582 -0.018888
C  2.571311 1.737021 -0.372789
C  -3.374318 0.777187 -0.240903
C  0.970436 -1.286385 1.083887
C  4.079918 1.937465 -0.649853
C  1.75742 2.941792 -0.900669
C  -3.944995 1.840494 -1.209448
C  -4.172892 0.771518 1.086255
C  0.857218 -2.29952 -0.071568
H  0.234833 2.016464 1.321398
H  0.827034 0.968709 2.634105
H  -1.438839 -1.067961 0.342855
H  -1.542667 -0.105918 1.846788
H  3.026378 0.704571 1.490223
H  2.61754 2.412218 1.70824
H  -1.346118 1.077732 -0.999727
H  -1.729703 2.002877 0.474993
H  2.225796 0.830445 -0.908021
H  -3.493023 -0.2193 -0.719401
H  2.050575 -1.114166 1.234086
H  0.58005 -1.742947 2.033624
H  4.670828 1.065163 -0.311117
H  4.465329 2.833838 -0.124033
H  4.269702 2.073636 -1.730808
H  1.969444 3.116005 -1.972158
H  2.017679 3.867877 -0.34979
H  0.670092 2.772952 -0.802136
H  -3.410372 1.829731 -2.177442
H  -3.844491 2.855858 -0.778775
H  -5.018452 1.664514 -1.409519
H  -5.253819 0.635917 0.894559
H  -4.043571 1.733306 1.620445
H  -3.848766 -0.03887 1.764162
H  -0.123094 -3.656282 1.219481
H  1.008702 -4.941774 -0.92539
H  -0.45002 -4.275961 -1.449157
