program: Gaussian 09
title: 000017542
version: EM64L-G09RevD.01
frameworkgroup: C1[X(C8H19N3O)]
method: RPBEPBE
basis: SDD
operation: Freq
keyword: #p
keyword: freq=noraman
keyword: PBEPBE/SDD
title: #p freq=noraman PBEPBE/SDD
converged: YES YES NO NO
title: Mulliken charges:
elementType: O N N N C C C C C C C C H H H H H H H H H H H H H H H H H H H
charge: -0.233883 -0.096200 -0.381910 -0.502896 -0.318650 -0.318770 -0.449264 -0.364224 -0.361151 -0.684670 -0.684981 0.190905 0.176761 0.206154 0.174067 0.199716 0.234055 0.176424 0.230186 0.191465 0.225351 0.192920 0.205429 0.208721 0.221283 0.205565 0.208086 0.222312 0.317036 0.304002 0.306163
chargesum: 0.00000
title: Mulliken charges with hydrogens summed into heavy atoms:
elementType: O N N N C C C C C C C C
charge: -0.233883 -0.096200 -0.064875 0.107268 0.064264 0.055012 -0.038785 0.057428 0.057120 -0.049237 -0.049018 0.190905
polarizability: 1.31851424e+02 -3.23343053e+00 1.10778968e+02 1.11553560e+00 2.40080840e-01 9.82886752e+01
1716.lowfreq: -16.0083 -12.6996 -8.6552 -3.5063 -0.0006 -0.0005 0.0002 34.3591 48.8634
frequency: -10.1383 34.2921 48.5682 51.8640 56.1461 64.2994 106.3972 149.5074 168.6197 198.9183 215.6344 221.7856 233.3581 257.4135 288.2461 311.0605 357.8545 387.7847 461.8576 486.1394 556.8518 625.2051 741.9454 743.2552 752.1288 781.7128 820.4962 869.0670 871.5498 897.3410 914.5341 941.7304 958.0277 1042.3634 1047.8933 1075.0615 1088.0295 1109.1051 1116.0002 1132.6198 1166.2054 1197.9080 1230.4553 1248.2379 1255.5559 1275.9274 1286.4298 1286.8662 1293.3206 1309.4378 1317.4272 1362.0536 1368.7588 1378.2619 1389.6763 1390.2235 1430.0600 1450.4365 1465.9914 1466.4081 1474.3702 1475.8624 1477.8846 1479.0354 1486.2196 1488.0299 1630.6393 1680.4462 2791.3000 2832.5062 2845.1869 2972.2055 2972.5571 2985.7091 2987.8959 3012.5524 3027.5177 3040.2158 3043.9198 3045.2729 3071.6613 3072.8796 3076.3788 3076.6620 3388.5795 3502.1069 3542.5387
redmass: 6.1625 3.6350 1.7852 3.0495 1.9599 2.3665 1.3996 2.2019 3.2453 2.4897 1.2406 1.1677 2.0791 3.3985 2.8248 2.9608 3.1083 2.7133 3.4643 3.5394 1.4990 2.0879 1.1018 1.3646 2.1287 2.0173 3.0355 1.3539 1.2472 1.5308 2.1156 5.0829 1.9637 2.9319 2.7795 2.2342 2.0344 2.2719 2.1423 2.3357 1.9833 2.1242 1.8339 1.3096 1.3720 1.3564 1.1753 1.2004 1.1802 1.4126 1.4517 1.4014 1.4000 1.4209 1.2233 1.2250 1.6143 1.1105 1.0697 1.0775 1.0645 1.0565 1.0424 1.0432 1.0807 1.0844 7.7997 1.0647 1.0715 1.0712 1.0705 1.0358 1.0358 1.0641 1.0637 1.0848 1.0859 1.0842 1.0989 1.0979 1.1014 1.1016 1.0988 1.0987 1.0429 1.0984 1.0794
irintensity: 2.3706 0.2340 0.2310 1.0610 0.1144 0.1410 19.5671 4.7420 0.3201 2.8647 1.5433 1.7315 5.0116 12.7426 4.2497 0.9207 5.6264 14.0811 4.6410 1.9270 142.0017 31.3137 8.3471 4.8121 14.7998 139.5334 14.3296 2.8096 1.7443 2.9229 1.3556 16.5149 10.7574 10.0319 3.3848 40.0658 40.1954 7.7275 7.1343 2.2047 15.5422 5.8115 30.4047 7.9989 7.2433 13.0420 0.5592 9.4403 3.8436 2.6977 6.6766 2.3377 2.3912 0.7099 19.5898 11.1082 133.8625 19.9690 0.0426 1.2705 0.8901 2.1284 13.3588 12.8266 18.6699 9.7301 152.5689 26.8569 116.5362 46.3833 188.6949 53.3821 30.3120 24.3751 20.8266 25.4938 16.1725 13.6225 1.2945 4.1942 78.7951 89.0053 39.4156 59.6022 0.0789 1.4973 23.3579
temp: 298.150 k
press: 1.00000 atm
elementType: 8 7 7 7 6 6 6 6 6 6 6 6 1 1 1 1 1 1 1 1 1 1 1 1 1 1 1 1 1 1 1
symmnumber: 1
zpe: 713180.3 jmol-1
zpe.correction: 0.271636 hartree
zpe.thermalcorrener: 0.286753 hartree
zpe.thermalcorrenthalpy: 0.287697 hartree
zpe.thermalcorrgfe: 0.227867 hartree
zpe.sumelectzpe: -554.683520 hartree
zpe.sumelectthermal: -554.668403 hartree
zpe.sumelectthermalent: -554.667459 hartree
zpe.sumelectthermalfe: -554.727289 hartree
dipole: 0.5122 0.2958 -2.8983
dipole: 2.9581
quadrupole: -73.3819 -72.6108 -79.1651
quadrupole: 0.3132 0.3520 3.2615
quadrupole: 1.6707 2.4418 -4.1125 0.3132 0.3520 3.2615
hfenergy: -554.9551561 hartree
pointgroup: C01 [X(C8H19N3O1)]
dipole: 0.2427784 0.0437414 -1.1373415 debye
polarizability: 130.7556779|-5.4640422|111.7674674|2.2062484|-0.6072869|98.3959216 unknown
InChI: InChI=1S/C8H19N3O/c1-3-5-11(6-4-2)7-8(12)10-9/h10H,3-7,9H2,1-2H3
charge 0 multiplicity 1
31 atoms
O  -1.956145 -0.770026 1.323649
N  0.606763 -0.141281 -0.230852
N  -2.880158 -0.510902 -0.790056
N  -4.204092 -0.278856 -0.328113
C  0.407803 1.269551 -0.645084
C  1.953742 -0.687529 -0.529929
C  -0.479205 -1.037327 -0.65753
C  1.105222 2.277252 0.294062
C  2.404772 -1.777626 0.466394
C  0.874764 3.738001 -0.150024
C  3.808031 -2.326304 0.128329
C  -1.808792 -0.756406 0.069186
H  0.745013 1.444342 -1.700563
H  -0.678888 1.480936 -0.623664
H  2.012931 -1.091439 -1.574802
H  2.676745 0.147374 -0.480698
H  -0.199962 -2.075349 -0.400736
H  -0.646669 -1.014928 -1.769737
H  0.717603 2.114811 1.316666
H  2.193029 2.07172 0.332279
H  2.389166 -1.344412 1.483403
H  1.676787 -2.612774 0.474751
H  1.271205 3.916466 -1.167917
H  -0.203504 3.986595 -0.161057
H  1.374863 4.445983 0.535209
H  3.83071 -2.775924 -0.882892
H  4.56879 -1.523028 0.154931
H  4.116177 -3.104232 0.849865
H  -2.753127 -0.472023 -1.802713
H  -4.5604 -1.111608 0.163598
H  -4.219572 0.534042 0.305144
