program: Gaussian 09
title: 000190292
version: EM64L-G09RevD.01
frameworkgroup: C1[X(C14H13N)]
method: RPBEPBE
basis: SDD
operation: Freq
keyword: #pfreq=noraman
keyword: PBEPBE/SDD
title: #p freq=noraman PBEPBE/SDD
converged: YES YES NO NO
title: Mulliken charges:
elementType: N C C C C C C C C C C C C C C H H H H H H H H H H H H H
charge: -0.015968 0.248744 -0.538120 0.153953 0.186873 -0.501735 0.443071 0.009306 -0.398810 -0.502556 -0.389411 -0.434705 -0.773501 -0.258393 -0.242487 0.234857 0.213799 0.231283 0.217664 0.240254 0.237782 0.230486 0.242433 0.228376 0.219883 0.258659 0.228333 0.229929
chargesum: 0.00000
title: Mulliken charges with hydrogens summed into heavy atoms:
elementType: N C C C C C C C C C C C C C C
charge: -0.015968 0.248744 -0.089465 0.153953 0.186873 -0.052787 0.443071 0.009306 -0.158556 -0.264774 -0.158924 -0.192272 -0.066583 -0.030060 -0.012558
polarizability: 2.36973666e+02 3.73215817e+00 1.69904773e+02 -9.42303650e-01 -2.57545804e+00 7.58654358e+01
1716.lowfreq: -13.0478 -5.7405 -0.0002 0.0004 0.0007 2.5478 66.8967 89.9253 148.4920
frequency: 66.8684 89.9062 148.4904 194.2859 211.2792 215.1970 247.4259 293.3206 306.1801 401.5488 411.5188 444.4073 460.1408 475.4937 507.7116 539.3515 568.8103 584.1530 637.8049 649.8703 692.0024 707.2895 760.3008 801.2727 830.4465 833.9470 842.9407 885.2780 889.7129 900.8390 958.4614 977.8208 980.8987 993.3836 1027.7285 1029.2616 1048.5826 1052.9566 1080.5207 1146.5779 1160.1990 1175.8118 1177.3935 1211.7182 1233.2816 1240.3824 1262.4943 1295.6675 1307.9408 1339.1544 1377.0910 1386.8114 1405.9730 1413.4244 1434.1872 1443.8280 1452.9944 1460.9073 1462.3408 1469.6214 1515.8720 1560.6019 1594.6462 1607.3726 1633.0623 2952.1972 2961.5493 2978.5995 3048.3226 3050.1356 3057.1079 3119.2754 3122.6546 3127.7199 3133.9334 3150.0172 3159.9132 3165.1603
redmass: 3.7613 3.4349 2.6538 1.3194 4.2369 2.5486 2.5598 2.4098 3.7236 3.8506 3.3682 3.9934 3.9572 3.6562 4.2779 3.5387 5.0416 3.3330 5.4755 3.1571 3.1780 3.4857 1.3306 2.6853 3.3597 1.6338 4.1977 1.8209 2.2804 2.8483 1.3530 1.4410 2.4749 1.3558 1.8731 2.1503 1.8686 2.2006 3.0857 1.9266 1.3777 1.2380 1.1093 1.8930 1.4461 1.6931 1.7831 3.1989 1.3967 1.6494 1.9185 1.3792 3.3458 3.4881 3.8881 1.1731 1.1360 1.0769 1.9823 1.0763 3.5748 6.8213 6.8942 6.1924 6.8655 1.0706 1.0643 1.0385 1.0913 1.0955 1.0965 1.0980 1.0863 1.0879 1.0882 1.0942 1.0954 1.1001
irintensity: 0.1082 0.1952 1.0010 4.2718 1.2733 0.7747 5.2268 6.1561 0.3510 0.3496 3.2145 6.0009 5.3587 1.6326 1.3496 4.4241 3.7912 5.8861 0.1555 5.6154 0.6441 8.1511 51.2479 1.8192 11.2032 56.1401 3.5398 6.3762 7.3792 6.6464 1.3128 1.3899 5.0454 0.4533 5.2176 7.0859 0.3746 0.2049 7.6756 10.7098 0.4750 3.5554 0.5586 0.8184 8.9442 4.3608 22.0742 56.8787 3.6072 2.1089 24.7041 33.7475 1.5401 1.1781 0.1070 14.2824 6.5357 13.5195 8.7714 20.0741 6.8444 8.1752 11.0360 33.0488 5.1220 29.5119 37.3283 16.8037 31.9711 37.6196 20.0294 16.9222 1.5234 5.5896 6.1653 30.1188 24.2264 29.9886
temp: 298.150 k
press: 1.00000 atm
elementType: 7 6 6 6 6 6 6 6 6 6 6 6 6 6 6 1 1 1 1 1 1 1 1 1 1 1 1 1
symmnumber: 1
zpe: 601382.8 jmol-1
zpe.correction: 0.229055 hartree
zpe.thermalcorrener: 0.240811 hartree
zpe.thermalcorrenthalpy: 0.241755 hartree
zpe.thermalcorrgfe: 0.191633 hartree
zpe.sumelectzpe: -595.005186 hartree
zpe.sumelectthermal: -594.993430 hartree
zpe.sumelectthermalent: -594.992486 hartree
zpe.sumelectthermalfe: -595.042608 hartree
dipole: -2.3371 0.3742 0.0936
dipole: 2.3687
quadrupole: -90.2568 -75.9101 -92.0841
quadrupole: 3.9019 0.6157 -0.7230
quadrupole: -4.1732 10.1736 -6.0004 3.9019 0.6157 -0.7230
hfenergy: -595.2342409 hartree
pointgroup: C01 [X(C14H13N1)]
dipole: -0.9212642 -0.1369263 -0.0314625 debye
polarizability: 236.8886866|-4.4833886|170.0228658|-0.2005377|-1.9705954|75.832322 unknown
InChI: InChI=1S/C14H13N/c1-10-12-7-6-11-4-2-3-5-13(11)14(12)8-9-15-10/h2-7H,8-9H2,1H3
charge 0 multiplicity 1
28 atoms
N  3.307338 0.821288 0.121971
C  0.387896 0.570766 -0.074062
C  1.043894 1.935112 -0.234217
C  1.245499 -0.551598 -0.009418
C  -1.040959 0.390593 -0.045826
C  2.416568 1.961925 0.472263
C  -1.584572 -0.949879 0.083749
C  2.727127 -0.341343 -0.088525
C  0.690014 -1.870339 0.108982
C  -0.686951 -2.064169 0.163024
C  -1.965089 1.487078 -0.147689
C  -3.005421 -1.134953 0.120569
C  3.628725 -1.52028 -0.405706
C  -3.345345 1.276072 -0.11427
C  -3.873682 -0.046148 0.024922
H  1.181926 2.1445 -1.316629
H  0.412418 2.745636 0.169749
H  2.957017 2.89384 0.230409
H  2.270913 1.947804 1.574617
H  1.361786 -2.732564 0.162103
H  -1.103188 -3.073798 0.259567
H  -1.584215 2.507234 -0.258481
H  -3.401029 -2.152504 0.223034
H  3.322896 -2.02612 -1.340329
H  3.604113 -2.276737 0.402393
H  4.662357 -1.156789 -0.508778
H  -4.030862 2.126817 -0.194729
H  -4.958075 -0.198444 0.053606
