program: Gaussian 09
title: 000190262
version: EM64L-G09RevD.01
frameworkgroup: C1[X(C14H11NO4S)]
method: RPBEPBE
basis: SDD
operation: Freq
keyword: #p
keyword: freq=noraman
keyword: PBEPBE/SDD
title: #p freq=noraman PBEPBE/SDD
converged: YES YES NO NO
title: Mulliken charges:
elementType: S O O O O N C C C C C C C C C C C C C C H H H H H H H H H H H
charge: 0.085785 -0.165644 -0.296523 -0.201790 -0.203162 0.021842 0.482320 -0.442326 -0.390734 -0.365395 0.470954 0.414768 -0.505346 -0.221890 -0.221695 -0.328475 -0.369520 -0.226126 -0.157908 -0.152568 0.238534 0.239779 0.232858 0.236487 0.307726 0.281410 0.232163 0.232693 0.291386 0.245939 0.234456
chargesum: 0.00000
title: Mulliken charges with hydrogens summed into heavy atoms:
elementType: S O O O O N C C C C C C C C C C C C C C
charge: 0.085785 -0.165644 -0.296523 -0.201790 -0.203162 0.021842 0.482320 0.035988 -0.157876 -0.128908 0.470954 0.414768 -0.197620 0.010274 0.010998 -0.047065 -0.078134 0.008330 0.088031 -0.152568
polarizability: 3.02859174e+02 -4.35314260e-02 1.76941828e+02 4.03704230e+00 1.71250819e+01 1.32319094e+02
1716.lowfreq: -4.1851 0.0012 0.0013 0.0016 2.4738 5.7911 8.2345 18.2325 26.1851
frequency: 6.4515 18.2045 26.1683 42.8874 54.5292 65.3720 93.3313 123.3505 139.3266 163.4389 200.6183 224.8977 251.7101 325.7270 340.2047 387.1282 389.2371 401.9145 418.5434 432.0506 498.3871 516.6951 526.7082 566.3094 577.7536 610.7612 616.9661 654.1771 677.2733 694.0471 703.7797 708.0349 751.1279 784.5908 804.6461 809.0784 832.5633 853.1990 919.1375 922.9521 932.8504 934.6748 946.3422 978.4680 986.2462 991.0255 993.3812 1000.9346 1026.2112 1038.3143 1071.8755 1084.7312 1089.1654 1171.8425 1173.1850 1175.8423 1184.1253 1188.8427 1213.2519 1222.0523 1234.0907 1275.3926 1326.4585 1348.0086 1373.8616 1388.2215 1403.7732 1437.0686 1442.2698 1462.5344 1466.9964 1487.7481 1597.1071 1597.9058 1604.4930 1617.4157 3030.2061 3103.6636 3124.5961 3127.1581 3139.1114 3152.8262 3159.9823 3168.4542 3186.1614 3192.7099 3194.8623
redmass: 3.9896 6.3005 7.0834 7.5106 8.6337 8.0277 6.6780 6.4246 7.1933 6.1880 9.5393 5.8205 5.3210 2.4072 6.4402 7.8914 8.0857 2.7848 6.1128 3.4438 5.4036 5.0175 5.7996 11.9128 5.6142 8.3844 6.3390 7.4615 2.6122 5.0868 1.9965 5.2070 2.5677 7.7052 1.4479 5.7133 3.8069 1.2490 1.4860 2.6330 2.0090 1.4270 1.6542 1.3953 6.3375 6.1285 1.3553 1.3331 2.2708 8.4015 1.7845 1.5500 1.5228 1.0716 1.1731 1.0529 3.5224 1.1949 6.5613 6.8020 2.2110 1.3703 1.2779 1.5923 10.6719 8.8195 9.2347 2.9041 2.1980 1.1326 2.5432 2.4360 6.1335 7.4061 7.2458 6.1772 1.0574 1.1092 1.0870 1.0879 1.0917 1.0962 1.0889 1.1016 1.0930 1.0946 1.0969
irintensity: 0.1701 1.1617 1.2155 1.2917 0.7071 0.9604 3.6731 1.8998 1.7875 0.9149 1.7177 6.4872 0.4800 1.9679 1.9593 4.0699 4.9344 0.1442 1.9700 1.4795 11.5762 10.9705 11.1790 0.7371 19.2962 9.7678 0.1273 5.4419 20.0587 3.2977 74.6063 14.6084 80.9757 28.7743 26.8444 48.7330 14.1712 0.0079 6.0469 3.0288 4.0946 27.7957 2.4060 0.0317 45.7261 1.7841 2.0306 0.0403 57.4500 741.1810 5.2156 29.8116 7.6733 3.0865 19.7812 0.5631 166.9184 5.6847 642.0055 412.8225 35.2730 15.6682 0.4979 21.0519 103.4559 1.0210 0.9393 13.0654 9.6667 19.8838 92.7390 4.9782 0.8669 6.9296 12.5723 0.5437 16.4442 8.9167 5.9919 3.3758 11.4380 33.4830 8.3799 21.6586 0.0822 1.7293 9.4754
temp: 298.150 k
press: 1.00000 atm
elementType: 16 8 8 8 8 7 6 6 6 6 6 6 6 6 6 6 6 6 6 6 1 1 1 1 1 1 1 1 1 1 1
symmnumber: 1
zpe: 581263.8 jmol-1
zpe.correction: 0.221392 hartree
zpe.thermalcorrener: 0.239155 hartree
zpe.thermalcorrenthalpy: 0.240099 hartree
zpe.thermalcorrgfe: 0.170128 hartree
zpe.sumelectzpe: -1292.273802 hartree
zpe.sumelectthermal: -1292.256039 hartree
zpe.sumelectthermalent: -1292.255095 hartree
zpe.sumelectthermalfe: -1292.325065 hartree
dipole: -3.8541 0.8278 3.4536
dipole: 5.2408
quadrupole: -122.2431 -132.0242 -119.2824
quadrupole: 25.4922 3.8939 9.6470
quadrupole: 2.2735 -7.5076 5.2341 25.4922 3.8939 9.6470
hfenergy: -1292.4951936 hartree
pointgroup: C01 [X(C14H11N1O4S1)]
dipole: 1.5414161 0.9928185 -0.9432848 debye
polarizability: 302.5458113|-2.2578706|179.93386|8.1877169|12.2166597|129.640425 unknown
InChI: InChI=1S/C14H11NO4S/c16-15(17)12-7-4-8-13(9-12)19-14(20)18-10-11-5-2-1-3-6-11/h1-9H,10H2
charge 0 multiplicity 1
31 atoms
S  -0.113874 1.498602 2.586712
O  1.745848 0.580814 0.892691
O  -0.353122 0.458159 0.026218
O  -6.063036 -1.236616 -0.88227
O  -4.211491 -2.568873 -0.929974
N  -4.791117 -1.425766 -0.773074
C  3.66639 -0.236967 -0.369904
C  2.172401 -0.083735 -0.422902
C  4.509245 0.730173 -0.972936
C  4.249824 -1.352572 0.28303
C  -1.762215 0.66978 -0.006429
C  -3.939978 -0.25332 -0.446121
C  -2.549661 -0.451273 -0.309759
C  5.913416 0.586483 -0.924201
C  5.652849 -1.497254 0.335502
C  -2.320846 1.957143 0.153492
C  -4.544578 1.011421 -0.284307
C  6.487382 -0.527935 -0.269445
C  -3.718274 2.11436 0.016074
C  0.433141 0.840232 1.140094
H  1.835312 0.570497 -1.243729
H  1.640674 -1.048506 -0.478154
H  4.065979 1.59779 -1.476722
H  3.604286 -2.102311 0.756024
H  -2.112628 -1.444284 -0.43632
H  -1.679258 2.81161 0.381406
H  6.556879 1.338328 -1.393697
H  6.094929 -2.361283 0.843159
H  -5.626796 1.110309 -0.397872
H  -4.161883 3.106514 0.142041
H  7.576503 -0.641116 -0.231529
