program: Gaussian 09
title: 000190249
version: EM64L-G09RevD.01
frameworkgroup: C1[X(C6H2Cl2N2S)]
method: RPBEPBE
basis: SDD
operation: Freq
keyword: #p
keyword: freq=noraman
keyword: PBEPBE/SDD
title: #p freq=noraman PBEPBE/SDD
converged: NO NO NO NO
title: Mulliken charges:
elementType: Cl Cl S N N C C C C C C H H
charge: 0.061896 0.009503 0.247263 -0.008084 -0.146084 0.530653 -0.499772 -0.210083 -0.216888 -0.088046 -0.211407 0.263110 0.267938
chargesum: 0.00000
title: Mulliken charges with hydrogens summed into heavy atoms:
elementType: Cl Cl S N N C C C C C C
charge: 0.061896 0.009503 0.247263 -0.008084 -0.146084 0.530653 -0.499772 -0.210083 0.046222 -0.088046 0.056531
polarizability: 1.72747582e+02 -2.66019330e+00 1.29319337e+02 -1.34478349e-02 1.28189596e-02 4.02672739e+01
1716.lowfreq: -8.6342 -4.2053 0.0018 0.0023 0.0026 2.9881 84.3709 120.8551 183.2299
frequency: 84.3481 120.8503 183.2299 203.7733 227.6364 287.8441 316.8748 328.2861 381.5378 461.0305 465.7879 538.7320 549.4984 593.9837 601.7160 733.6645 735.4864 804.5769 809.6284 865.1021 954.3985 1078.4846 1128.3793 1172.9538 1183.5218 1327.9975 1402.3920 1414.7902 1469.7981 1520.5711 1582.6143 3167.7686 3187.1891
redmass: 12.9980 16.8915 30.1451 19.6629 6.2712 7.2694 21.6213 19.9475 16.7014 6.4946 6.6141 5.4313 9.8777 11.2219 6.7416 11.5085 9.5875 10.2482 1.3461 8.2231 1.3389 8.6178 2.4686 2.4007 2.1707 3.1344 4.8662 3.6947 12.2054 7.5900 8.4604 1.0886 1.0975
irintensity: 1.2908 0.2240 0.0221 0.1649 1.0454 0.1777 26.7624 23.3163 1.7857 14.5858 5.1334 4.6336 0.0464 5.1364 3.5182 36.3234 0.9463 51.9604 40.9526 31.2541 0.0018 29.1309 13.7897 8.9631 13.8770 16.1011 65.8424 43.8590 161.3097 5.1357 0.9588 0.0004 0.8927
temp: 298.150 k
press: 1.00000 atm
elementType: 17 17 16 7 7 6 6 6 6 6 6 1 1
symmnumber: 1
zpe: 178748.7 jmol-1
zpe.correction: 0.068082 hartree
zpe.thermalcorrener: 0.077380 hartree
zpe.thermalcorrenthalpy: 0.078325 hartree
zpe.thermalcorrgfe: 0.032384 hartree
zpe.sumelectzpe: -1656.720957 hartree
zpe.sumelectthermal: -1656.711659 hartree
zpe.sumelectthermalent: -1656.710715 hartree
zpe.sumelectthermalfe: -1656.756655 hartree
dipole: -0.7053 -3.5020 -0.0015
dipole: 3.5723
quadrupole: -90.2392 -79.1718 -84.5657
quadrupole: -3.6560 -0.0062 -0.0015
quadrupole: -5.5803 5.4871 0.0932 -3.6560 -0.0062 -0.0015
hfenergy: -1656.7890392 hartree
pointgroup: C01 [X(C6H2Cl2N2S1)]
dipole: 0.5703269 1.2845484 -0.0005898 debye
dipolederiv: -0.0656338 0.1397142 0.0000123 0.2227897 -0.577512 -0.0000561 0.0000765 0.0000191 0.0198512 -0.7287484 0.0650368 -0.000012 0.1160852 -0.0489648 -0.0000006 -0.0000272 0.00001 -0.0194822 -0.225302 -0.0040174 -0.0000029 0.062047 -0.6072851 0.0004521 -0.0007283 0.0009404 0.0985381 -0.0333527 1.047799 -0.0003722 0.3448342 -0.5626717 0.0004604 0.0001971 -0.0009535 -0.0311624 -0.2348812 -0.837395 -0.0000657 -0.2658048 1.0290371 -0.000979 0.0003162 -0.000022 -0.15663 -0.1244911 -0.2151074 0.0001386 -0.0492853 -0.2004674 0.0000259 -0.0004234 0.0000837 0.1329981 0.5881378 0.0385095 0.0004714 0.1555887 -0.0781109 0.0000575 0.0006378 -0.000007 -0.1301716 0.0579495 -0.0824245 -0.000092 -0.2745438 1.0368427 0.0000695 -0.0001477 -0.000022 -0.0235189 -0.3352779 0.0609776 -0.0001521 -0.0477884 0.1431404 0.0000091 0.0001537 -0.0000693 -0.0885574 1.0853969 -0.1346817 0.0000697 -0.1885394 -0.3619032 0.0000368 0.0000201 -0.0000717 -0.0589661 -0.0723602 -0.0786051 0.0000451 -0.0381418 0.1826098 -0.0000446 -0.000096 0.0000331 -0.0737722 0.0546211 0.0596187 -0.0000329 0.0084093 0.0031199 -0.0000172 -0.0000092 0.0000725 0.170378 0.0339421 -0.0594246 -0.0000074 -0.0456504 0.0421652 -0.0000138 0.0000304 -0.0000133 0.1604955 unknown
polarizability: 169.5668783|-11.6229145|132.5000408|0.0103399|-0.0154356|40.2672739 unknown
InChI: InChI=1S/C6H2Cl2N2S/c7-3-1-2-4-6(5(3)8)9-10-11-4/h1-2H
charge 0 multiplicity 1
13 atoms
Cl 1.276844 -2.501215 -0.000293
Cl 3.529472 -0.099247 0.00004
S  -2.752176 1.15261 -0.00113
N  -1.631913 -1.324747 -0.00008
N  -2.824784 -0.910877 0.001212
C  -0.566405 -0.415896 -0.000233
C  -0.988746 0.962918 -0.000055
C  0.81043 -0.769242 -0.000188
C  -0.003992 1.981983 0.000118
C  1.758396 0.263609 0.000041
C  1.355382 1.626683 0.000213
H  -0.291001 3.035943 -0.000005
H  2.125791 2.402977 0.000262
