program: Gaussian 09
title: 000190243
version: EM64L-G09RevD.01
frameworkgroup: C1[X(C9H13BrN2O3)]
method: RPBEPBE
basis: SDD
operation: Freq
keyword: #p
keyword: freq=noraman
keyword: PBEPBE/SDD
title: #p freq=noraman PBEPBE/SDD
converged: YES YES NO NO
title: Mulliken charges:
elementType: Br O O O N N C C C C C C C C C H H H H H H H H H H H H H
charge: 0.059558 -0.432952 -0.233489 -0.261913 -0.266293 -0.428814 -0.000938 -0.421540 -0.710807 -0.317082 0.396894 0.160265 0.428315 -0.476935 -0.773348 0.247973 0.188691 0.275298 0.219380 0.215480 0.267967 0.220773 0.191823 0.347542 0.220239 0.278297 0.277154 0.328462
chargesum: 0.00000
title: Mulliken charges with hydrogens summed into heavy atoms:
elementType: Br O O O N N C C C C C C C C C
charge: 0.059558 -0.104490 -0.233489 -0.261913 -0.266293 -0.081272 0.247035 0.042449 -0.007980 0.095514 0.396894 0.160265 0.428315 -0.476935 0.002342
polarizability: 1.65689215e+02 -6.72856171e+00 1.48514682e+02 -1.29893441e+01 -9.89062448e+00 9.48682107e+01
1716.lowfreq: -7.9395 -2.3178 0.0003 0.0003 0.0004 8.6051 27.4845 45.6949 68.7533
frequency: 27.4114 45.6619 68.7504 74.1569 84.1388 88.0383 142.7925 161.6241 177.4292 207.4376 222.0637 222.8821 261.6772 270.3953 280.8182 318.0565 338.2801 350.1414 402.2403 446.1129 492.1836 503.6354 559.6890 566.9027 616.0632 631.9158 645.7889 722.5932 744.1376 750.9858 810.5213 909.0890 950.1018 975.3790 987.7140 1019.4171 1039.2022 1045.2737 1053.3157 1075.0080 1089.7910 1134.1868 1140.1492 1162.1988 1198.5738 1262.6297 1272.0844 1290.2907 1337.0900 1350.0780 1353.3001 1383.2546 1389.2263 1391.1098 1405.9683 1445.2477 1450.2075 1464.5168 1466.2054 1478.2778 1482.7792 1491.7036 1589.0036 1622.7846 1649.1637 2951.9836 2977.8692 2994.0924 2994.8485 3033.2772 3066.9226 3082.8975 3085.0794 3089.2738 3097.3201 3120.7977 3553.1465 3557.3394
redmass: 6.7302 5.0976 2.0197 1.8870 1.8591 4.2230 6.2558 2.9868 3.2589 2.6569 3.3838 1.3849 8.7151 7.7459 2.8569 1.4039 4.4245 4.7090 9.0459 3.8916 3.7943 3.0079 8.1887 4.3042 5.9947 1.3050 5.0526 5.0091 6.2264 4.4254 1.2865 1.9197 3.2925 1.7110 1.8488 2.5731 1.5007 2.7699 4.5239 2.4588 2.5898 2.0940 3.5519 3.4237 2.1295 2.8035 1.3355 1.1188 1.2497 1.6704 2.4396 1.2237 1.2303 1.2892 1.2261 2.1062 1.0429 1.0636 1.0669 1.2838 1.0867 1.0668 7.2284 8.9781 5.8639 1.0693 1.0672 1.0373 1.0367 1.0847 1.0911 1.0990 1.0977 1.0980 1.1007 1.0993 1.0778 1.0662
irintensity: 0.4987 4.8947 1.0160 3.9381 2.5021 1.8448 0.9835 0.6060 2.1546 2.8874 1.9150 3.7091 9.2888 3.9637 18.8605 117.0698 0.3405 16.9096 10.5727 5.9833 2.9963 3.3023 17.4482 4.9599 8.5220 64.8183 10.2817 20.1374 44.6681 41.0855 0.6800 6.7317 67.0618 6.6926 8.4224 54.1386 8.9478 46.8633 18.9791 0.8718 31.6383 7.3932 12.8855 18.2724 29.8992 57.9683 15.7741 8.8605 12.3482 44.1317 107.1535 27.6910 32.7630 1.8262 38.8704 6.9602 18.4387 2.0895 33.3182 17.4776 5.4882 28.7435 245.5002 248.2185 396.8642 51.0170 31.7190 32.7953 9.6028 5.9411 19.3098 28.0477 4.0147 29.1339 15.4925 7.7716 79.5982 6.0295
temp: 298.150 k
press: 1.00000 atm
elementType: 35 8 8 8 7 7 6 6 6 6 6 6 6 6 6 1 1 1 1 1 1 1 1 1 1 1 1 1
symmnumber: 1
zpe: 569384.7 jmol-1
zpe.correction: 0.216867 hartree
zpe.thermalcorrener: 0.233285 hartree
zpe.thermalcorrenthalpy: 0.234229 hartree
zpe.thermalcorrgfe: 0.171218 hartree
zpe.sumelectzpe: -698.262311 hartree
zpe.sumelectthermal: -698.245894 hartree
zpe.sumelectthermalent: -698.244950 hartree
zpe.sumelectthermalfe: -698.307961 hartree
dipole: 1.7935 3.9103 0.5186
dipole: 4.3331
quadrupole: -83.8391 -102.4633 -104.3455
quadrupole: 14.2936 -9.2397 -5.3281
quadrupole: 13.0436 -5.5807 -7.4629 14.2936 -9.2397 -5.3281
hfenergy: -698.4791786 hartree
pointgroup: C01 [X(C9H13Br1N2O3)]
dipole: 1.1669379 -1.2350828 -0.1382738 debye
polarizability: 159.4245181|11.3143|153.8826477|15.7513082|-7.5479007|95.764941 unknown
InChI: InChI=1S/C9H13BrN2O3/c1-5(3-4-13)12-8(14)7(10)6(2)11-9(12)15/h5,11,13H,3-4H2,1-2H3
charge 0 multiplicity 1
28 atoms
Br 2.815833 2.508458 0.045779
O  -3.569874 0.690036 2.279891
O  -0.141923 1.984605 -0.838615
O  -0.31469 -2.674376 -0.083138
N  -0.269533 -0.336664 -0.475397
N  1.634311 -1.491705 0.353137
C  -1.702865 -0.379089 -0.95437
C  -2.640936 0.436189 -0.028581
C  -1.806626 0.032895 -2.437926
C  -2.627452 -0.056081 1.431166
C  0.428892 0.923166 -0.464956
C  0.294367 -1.567524 -0.075521
C  2.407907 -0.332964 0.407021
C  1.821057 0.84958 0.006195
C  3.824865 -0.478567 0.902524
H  -1.968659 -1.448351 -0.866653
H  -3.664963 0.320273 -0.441826
H  -2.388067 1.508514 -0.066403
H  -1.122125 -0.570941 -3.059991
H  -2.837192 -0.152307 -2.791498
H  -1.571349 1.099202 -2.577279
H  -1.646239 0.128886 1.8999
H  -2.833841 -1.147966 1.47446
H  2.032038 -2.387815 0.642298
H  4.061892 -1.526037 1.156084
H  3.988256 0.144704 1.799104
H  4.541573 -0.131966 0.137616
H  -4.481354 0.596444 1.902975
