program: Gaussian 09
title: 000190230
version: EM64L-G09RevD.01
frameworkgroup: C1[X(C10H8Cl2O)]
method: RPBEPBE
basis: SDD
operation: Freq
keyword: #p
keyword: freq=noraman
keyword: PBEPBE/SDD
title: #p freq=noraman PBEPBE/SDD
converged: NO YES NO NO
title: Mulliken charges:
elementType: Cl Cl O C C C C C C C C C C H H H H H H H H
charge: 0.014093 0.066818 -0.165943 -0.397197 -0.546124 -0.544500 0.399152 0.110983 0.248506 -0.397799 -0.337132 -0.220317 -0.239116 0.244768 0.267853 0.236881 0.259001 0.240468 0.282322 0.236313 0.240970
chargesum: 0.00000
title: Mulliken charges with hydrogens summed into heavy atoms:
elementType: Cl Cl O C C C C C C C C C C
charge: 0.014093 0.066818 -0.165943 0.115424 -0.050242 -0.544500 0.399152 0.110983 0.248506 -0.157331 -0.054810 0.015996 0.001854
polarizability: 1.70379474e+02 -6.95413207e+00 1.25677764e+02 3.82566756e+00 1.90316236e+00 8.24597369e+01
1716.lowfreq: -8.3390 0.0018 0.0018 0.0020 3.6365 14.0166 41.4962 108.2390 142.5824
frequency: 41.4420 108.2264 142.5790 183.4397 193.8859 240.1616 241.5696 305.5986 311.6733 336.4265 420.7234 439.1573 467.8234 488.7524 521.3270 563.5400 620.0068 666.3406 707.7102 743.0972 755.3589 804.6406 810.7349 880.9859 895.6554 962.9161 980.6013 1007.7732 1008.5315 1038.9217 1042.8226 1105.1785 1135.9180 1176.1096 1186.7208 1211.6732 1223.9590 1243.0257 1290.1535 1322.5038 1358.2687 1390.2565 1441.4199 1446.4944 1451.6489 1477.9673 1577.3485 1590.8745 1619.8942 2985.6562 3004.3871 3051.4723 3085.4885 3125.0541 3142.4360 3155.1847 3171.1180
redmass: 8.8731 4.6651 12.2028 5.5015 11.0307 3.9698 5.0454 7.7879 2.9978 6.9258 3.3098 4.8799 4.6045 3.8487 6.0489 4.2772 6.8408 4.0477 4.7721 1.7857 3.1363 2.7131 3.5424 2.0406 1.4823 3.6262 1.4053 1.8999 1.8265 2.1842 2.4080 2.1051 3.0075 1.0667 1.2082 2.1637 1.8325 1.8440 1.4918 1.5062 1.5689 6.6777 2.2446 1.1080 1.1507 2.3429 7.4281 8.5336 7.5360 1.0635 1.0638 1.0970 1.0991 1.0876 1.0894 1.0937 1.1003
irintensity: 0.6301 0.6984 1.5022 1.2608 0.8569 0.4705 2.4348 3.8076 0.9234 1.6955 0.2225 5.6156 19.1619 0.5204 14.8068 47.1013 34.5907 16.6464 3.9446 20.2846 57.3507 61.6759 23.3435 33.8565 13.3842 9.0418 3.7146 1.0117 1.4205 1.6784 7.2735 10.0552 5.1267 5.8271 10.3654 1.1071 80.0424 15.0260 35.4725 1.2826 6.5102 3.7176 11.8953 12.5764 28.9785 8.7661 18.5627 132.2972 33.1698 9.2051 6.2883 16.0278 9.7381 5.0824 10.8873 7.6473 24.6479
temp: 298.150 k
press: 1.00000 atm
elementType: 17 17 8 6 6 6 6 6 6 6 6 6 6 1 1 1 1 1 1 1 1
symmnumber: 1
zpe: 400166.6 jmol-1
zpe.correction: 0.152415 hartree
zpe.thermalcorrener: 0.163519 hartree
zpe.thermalcorrenthalpy: 0.164463 hartree
zpe.thermalcorrgfe: 0.114742 hartree
zpe.sumelectzpe: -1380.287171 hartree
zpe.sumelectthermal: -1380.276068 hartree
zpe.sumelectthermalent: -1380.275124 hartree
zpe.sumelectthermalfe: -1380.324844 hartree
dipole: 4.2745 -3.6571 -1.4462
dipole: 5.8084
quadrupole: -83.5492 -87.3378 -90.8028
quadrupole: 3.9105 1.8521 2.6031
quadrupole: 3.6807 -0.1078 -3.5729 3.9105 1.8521 2.6031
hfenergy: -1380.4395866 hartree
pointgroup: C01 [X(C10H8Cl2O1)]
dipole: -1.6671786 1.520668 -0.3607731 debye
dipolederiv: -0.3035838 -0.0280933 -0.0955195 -0.0604543 -0.1908401 -0.0992643 -0.0857694 -0.0637534 -0.6900714 -0.6164707 0.158579 0.2392026 0.1569331 -0.1609671 -0.075288 0.2153226 -0.0757888 -0.2855124 -0.6488008 0.1017549 -0.0098493 0.3062335 -0.8303939 -0.0742485 0.0069541 -0.0201652 -0.25667 -0.0998087 0.0722655 0.0173214 -0.003457 -0.0906762 0.0131643 -0.0086646 0.036722 -0.0876495 0.035218 -0.0619425 0.0296899 -0.0087369 -0.0176981 -0.0314411 -0.0780745 -0.0941359 0.1181852 0.7700791 -0.2755296 -0.2168495 -0.3615472 0.2418209 0.0968725 -0.2017093 0.0859936 1.0834232 0.2972313 0.2267234 0.0112948 -0.0701634 0.1757123 -0.0057829 0.0557994 0.0569474 -0.0241273 -0.8080881 0.2041202 -0.0068428 -0.0095677 -0.179245 -0.0003352 0.0338116 -0.0272022 0.0072302 1.3941372 -0.1744089 0.1081417 -0.0723106 0.8655789 0.1197727 0.0866772 0.0801745 0.0068358 -0.3301241 -0.2073398 0.0020039 -0.1639672 0.077554 0.0097988 -0.002657 0.0127695 -0.1635901 0.1220375 -0.1825226 0.0040192 0.1591718 0.0247639 0.0043443 -0.0112407 0.001821 -0.079664 0.1557741 -0.0123826 -0.0046843 -0.046565 0.1315331 -0.0050209 -0.0127954 -0.0086906 -0.1119799 -0.0805253 0.2303801 -0.0115237 0.2080326 -0.0992559 -0.0026306 -0.0051275 -0.0084434 -0.166968 0.0786846 0.0219278 -0.0379345 0.0624579 0.0678328 -0.0165062 -0.0194946 -0.029045 -0.0742366 -0.0347559 -0.0928065 0.0047713 -0.0915369 0.0009386 0.0039775 -0.0140819 -0.0190385 0.1086103 -0.0120237 0.0760064 -0.0290101 0.0357635 -0.0594818 0.0755954 0.0079352 0.113886 0.0509667 0.0242661 -0.0822363 -0.0252182 -0.0465111 0.0617108 -0.0260516 0.0126824 -0.0557577 -0.0432398 0.079261 0.0142792 0.0031542 0.0612941 -0.1020659 0.0034183 0.0048432 0.0091917 0.1462795 0.1185771 0.0537613 0.004785 -0.0066274 0.0038012 0.0035586 -0.0002604 -0.0008137 0.1499181 -0.1065728 0.0490997 0.0070081 0.0551094 0.0805292 0.0009972 0.0063799 0.0004784 0.1525063 -0.034512 -0.0916353 0.0060398 -0.1035511 -0.0011519 0.0050698 0.0094697 0.0048503 0.1597534 unknown
polarizability: 170.2929802|-6.7413573|125.4375536|-4.4739135|4.365302|82.7864409 unknown
InChI: InChI=1S/C10H8Cl2O/c11-10(12)6-5-7-3-1-2-4-8(7)9(10)13/h1-4H,5-6H2
charge 0 multiplicity 1
21 atoms
Cl 2.301323 0.432302 1.806172
Cl 3.510872 -0.435514 -0.857857
O  1.152152 -2.17156 -0.154149
C  1.500311 1.477192 -0.676404
C  0.182521 1.984891 -0.0541
C  1.93758 0.155593 -0.046385
C  -0.899551 0.918917 -0.038313
C  -0.563493 -0.469133 -0.037737
C  0.850216 -0.952679 -0.0872
C  -2.266506 1.283221 -0.002349
C  -1.590181 -1.453539 0.004382
C  -3.28035 0.30316 0.042805
C  -2.941893 -1.07351 0.046974
H  1.363289 1.289777 -1.759678
H  2.306485 2.221199 -0.561571
H  -0.165147 2.874546 -0.609594
H  0.383977 2.31397 0.984782
H  -2.537323 2.345744 -0.010133
H  -1.292634 -2.507094 0.002931
H  -4.3321 0.608844 0.070757
H  -3.728548 -1.834128 0.08127
