program: Gaussian 09
title: 000190228
version: EM64L-G09RevD.01
frameworkgroup: C1[X(C19H25NO3)]
method: RPBEPBE
basis: SDD
operation: Freq
keyword: #p
keyword: freq=noraman
keyword: PBEPBE/SDD
title: #p freq=noraman PBEPBE/SDD
converged: YES YES NO NO
title: Mulliken charges:
elementType: O O O N C C C C C C C C C C C C C C C C C C C H H H H H H H H H H H H H H H H H H H H H H H H H
charge: -0.337455 -0.246899 -0.311586 -0.184696 -0.096107 0.007472 -0.673627 -0.672649 -0.705139 -0.706215 0.319252 -0.403972 0.357997 0.386593 -0.684818 -0.533866 -0.305830 0.497027 -0.436987 -0.382419 -0.220856 -0.216809 -0.247935 0.267553 0.193768 0.227034 0.217176 0.209842 0.216999 0.207335 0.231461 0.218539 0.206138 0.266477 0.206437 0.265011 0.218508 0.230988 0.256313 0.229074 0.243136 0.263915 0.266543 0.227996 0.252556 0.224832 0.224364 0.227530
chargesum: 0.00000
title: Mulliken charges with hydrogens summed into heavy atoms:
elementType: O O O N C C C C C C C C C C C C C C C C C C C
charge: -0.337455 -0.246899 -0.311586 -0.184696 0.171446 0.201240 -0.019575 -0.016854 -0.013986 -0.016260 0.319252 0.083329 0.357997 0.386593 -0.212608 -0.269951 -0.039287 0.497027 -0.208991 -0.129863 0.003975 0.007555 -0.020406
polarizability: 2.83976100e+02 4.22441960e+00 2.09368220e+02 1.76040881e+01 5.31843700e+00 1.61681870e+02
1716.lowfreq: -11.8086 -9.5743 -3.4626 -0.0006 -0.0005 -0.0001 0.6719 3.5567 15.9767
frequency: -11.2774 3.0004 15.8152 23.3240 27.2811 48.6325 58.8073 80.6516 89.6004 140.7463 144.8892 158.5157 188.8362 193.0094 212.5112 215.5531 224.5804 241.5468 243.6192 263.8454 280.1295 297.9263 313.3893 319.4133 329.5674 356.7962 390.3227 403.8436 456.3661 472.7790 478.1284 503.0618 552.7846 563.2241 583.1741 594.0496 613.9563 635.4693 676.9097 695.4048 702.3582 714.1872 728.8249 748.2296 773.5496 799.5678 831.5637 845.8315 854.0006 859.4616 873.0576 910.6242 915.1874 917.8027 925.4928 937.0985 944.5107 948.0401 973.6679 976.5104 990.1649 995.0234 1001.0029 1026.7005 1027.6096 1031.8671 1071.9066 1081.1606 1130.0510 1133.2245 1134.7637 1140.8331 1150.7462 1151.7558 1169.7235 1171.5746 1188.9413 1201.0745 1209.1771 1211.8911 1235.7050 1258.3716 1278.6630 1299.4198 1310.8757 1323.7387 1327.8414 1335.1426 1361.8477 1375.5452 1378.2901 1382.5294 1386.1843 1394.2749 1396.6261 1412.6450 1440.1141 1450.2372 1456.9208 1459.0520 1465.5208 1469.2909 1471.7542 1478.9192 1482.9850 1483.4628 1485.3350 1499.9616 1546.1999 1594.4189 1612.6066 1618.3675 1644.7409 2979.8859 2983.7190 2986.8500 2990.0473 2990.3102 2996.9360 3016.0178 3055.2092 3056.3648 3063.0272 3072.8451 3077.1148 3082.3923 3084.6884 3089.4766 3097.8294 3108.4978 3113.9190 3114.7084 3123.1278 3135.3093 3145.5690 3162.2611 3214.8541 3273.2928
redmass: 4.3188 4.2224 4.1745 5.1376 4.8162 3.1207 4.4040 2.8851 4.5572 5.2567 4.2897 3.0261 4.2346 2.9625 1.8754 1.4169 1.1154 1.0817 1.3934 2.0368 4.1726 3.9937 2.2930 3.5952 2.8415 2.7711 2.6086 2.8153 3.1524 3.4958 3.2068 4.3378 5.1787 3.5886 2.7701 3.0884 5.8739 4.4447 4.8383 10.9159 2.6521 2.1016 2.2758 1.6110 2.8336 2.7918 1.6131 2.7831 1.2480 2.5954 2.7679 1.8323 1.2681 2.6102 1.2446 1.3533 1.3608 2.0748 4.5337 1.3943 6.2156 1.3220 2.8066 2.2905 2.5486 1.9267 2.9440 2.1850 1.9163 2.4052 2.0994 1.3814 2.4319 2.2289 2.0423 1.0551 1.1372 2.5138 2.7022 1.3341 1.1107 1.9232 2.4417 1.7035 1.3602 1.8848 1.3383 1.3054 1.3096 1.2125 1.2080 6.0061 1.4594 1.2221 1.6713 1.8121 2.0449 1.1433 1.0433 1.1338 1.0458 1.0516 1.0499 1.0469 2.2117 1.0514 1.0552 1.0565 6.8671 6.1062 6.0776 6.3926 8.4958 1.0353 1.0358 1.0361 1.0377 1.0620 1.0570 1.0833 1.1050 1.0979 1.0915 1.0993 1.0998 1.0992 1.1004 1.0991 1.0931 1.0997 1.0990 1.0867 1.0863 1.0917 1.0962 1.1016 1.0984 1.1001
irintensity: 0.0472 0.1094 0.0321 0.8027 0.6902 0.0084 0.4140 0.1896 2.9282 0.8886 0.2270 0.2703 1.5588 1.0261 0.5974 0.4755 0.1094 0.2501 0.6762 1.6445 0.2931 22.8360 1.1338 2.1599 0.0357 17.4014 3.1371 0.2437 7.8964 3.3092 5.0298 5.3533 6.8760 5.4590 5.2586 11.5372 0.7287 6.9453 1.1329 17.4534 14.2282 23.7539 99.8022 38.7142 3.6678 12.7487 21.5348 16.7611 0.1354 13.2910 4.4904 2.1299 3.1218 4.8996 3.5373 0.0620 0.1464 15.9766 79.6440 1.7406 0.0168 2.0046 122.7077 56.0288 134.5129 5.3398 16.2683 10.5514 11.5961 5.6726 44.1508 38.6507 22.1189 32.8470 25.0459 0.2403 0.7147 0.0563 49.3375 5.0503 1.8898 10.0357 413.1951 22.1430 2.4757 20.0427 3.0246 2.7309 4.7975 1.4043 55.3921 1.9275 38.4721 6.5556 7.3087 61.7309 6.7852 20.4331 0.0797 33.0367 1.3829 2.8962 29.0865 12.9614 19.6232 2.0953 11.1640 14.7859 21.5162 1.1733 16.5551 4.9901 292.0667 21.4232 21.2948 35.4912 26.6996 20.2407 36.5766 24.8039 8.2299 8.2883 27.4160 2.8910 11.6716 70.5396 30.6499 44.1108 35.2659 2.5634 23.7314 8.1605 0.1147 16.7038 37.4595 25.8119 2.5634 0.0495
temp: 298.150 k
press: 1.00000 atm
elementType: 8 8 8 7 6 6 6 6 6 6 6 6 6 6 6 6 6 6 6 6 6 6 6 1 1 1 1 1 1 1 1 1 1 1 1 1 1 1 1 1 1 1 1 1 1 1 1 1
symmnumber: 1
zpe: 1050453.2 jmol-1
zpe.correction: 0.400096 hartree
zpe.thermalcorrener: 0.423175 hartree
zpe.thermalcorrenthalpy: 0.424119 hartree
zpe.thermalcorrgfe: 0.343000 hartree
zpe.sumelectzpe: -1017.704068 hartree
zpe.sumelectthermal: -1017.680990 hartree
zpe.sumelectthermalent: -1017.680045 hartree
zpe.sumelectthermalfe: -1017.761164 hartree
dipole: 0.8897 1.8633 -0.3196
dipole: 2.0894
quadrupole: -119.6043 -133.3894 -138.1184
quadrupole: 14.0727 6.7135 0.6113
quadrupole: 10.7664 -3.0187 -7.7477 14.0727 6.7135 0.6113
hfenergy: -1018.1041643 hartree
pointgroup: C01 [X(C19H25N1O3)]
dipole: -0.2584512 0.6520399 -0.4287307 debye
polarizability: 280.5533916|3.9300921|181.9112842|24.0862393|-25.075208|192.5615138 unknown
InChI: InChI=1S/C19H25NO3/c1-14(2)20(15(3)4)19(21)23-13-17-11-18(22-12-17)10-16-8-6-5-7-9-16/h5-9,11-12,14-15H,10,13H2,1-4H3
charge 0 multiplicity 1
48 atoms
O  -2.007023 1.080668 0.65139
O  1.677577 -0.57613 -0.725177
O  -3.418442 -0.622496 1.460913
N  -4.085487 0.755132 -0.327563
C  -3.760356 1.886834 -1.25303
C  -5.410151 0.063585 -0.471926
C  -3.680941 1.406288 -2.721864
C  -4.753123 3.060781 -1.079506
C  -5.246567 -1.421763 -0.871313
C  -6.293608 0.237579 0.785603
C  -3.215627 0.320198 0.645595
C  -0.983303 0.639572 1.623719
C  0.205243 0.059821 0.906636
C  2.216859 -0.971458 0.522691
C  3.55783 -1.646516 0.492296
C  1.34173 -0.597668 1.528778
C  0.446256 0.056603 -0.454463
C  4.752075 -0.686196 0.561519
C  5.762638 -0.866611 1.537523
C  4.872715 0.388173 -0.357329
C  6.874186 0.006078 1.597619
C  5.981711 1.260582 -0.299649
C  6.987354 1.07316 0.678174
H  -2.761895 2.238022 -0.951125
H  -5.90864 0.585638 -1.309878
H  -2.940907 0.593427 -2.8298
H  -3.374486 2.24436 -3.374023
H  -4.65595 1.036688 -3.089549
H  -4.445849 3.906374 -1.721482
H  -5.783001 2.78022 -1.368386
H  -4.767858 3.409107 -0.031913
H  -4.645009 -1.518587 -1.792922
H  -6.239926 -1.870222 -1.056499
H  -4.750534 -1.985336 -0.064619
H  -7.29139 -0.203403 0.605583
H  -5.836127 -0.269398 1.650544
H  -6.42597 1.306835 1.029945
H  -0.707835 1.544806 2.195042
H  -1.441223 -0.098325 2.308594
H  3.611619 -2.358444 1.335258
H  3.6210 -2.247536 -0.436066
H  1.487784 -0.771074 2.594054
H  -0.108942 0.41662 -1.313858
H  5.680736 -1.692856 2.25502
H  4.09239 0.540364 -1.112176
H  7.647043 -0.146596 2.359678
H  6.062388 2.086417 -1.015841
H  7.847239 1.75098 0.722784
