program: Gaussian 09
title: 000190219
version: EM64L-G09RevD.01
frameworkgroup: C1[X(C8H18ClO3P)]
method: RPBEPBE
basis: SDD
operation: Freq
keyword: #p
keyword: freq=noraman
keyword: PBEPBE/SDD
title: #p freq=noraman PBEPBE/SDD
converged: YES YES NO NO
title: Mulliken charges:
elementType: Cl P O O O C C C C C C C C H H H H H H H H H H H H H H H H H H
charge: -0.209146 1.179663 -0.502624 -0.501878 -0.556818 -0.064984 -0.068108 -0.254292 -0.306071 -0.685695 -0.695823 -0.673437 -0.687584 0.226549 0.235113 0.236252 0.230145 0.246779 0.226988 0.214343 0.198381 0.250497 0.228186 0.217396 0.208847 0.218349 0.196721 0.237934 0.227089 0.221187 0.206042
chargesum: 0.00000
title: Mulliken charges with hydrogens summed into heavy atoms:
elementType: Cl P O O O C C C C C C C C
charge: -0.209146 1.179663 -0.502624 -0.501878 -0.556818 0.161565 0.167005 0.212105 0.167696 -0.022473 -0.041394 -0.020433 -0.033266
polarizability: 1.59575797e+02 2.19368615e+00 1.17423518e+02 -4.42370795e+00 5.00343011e+00 1.28622948e+02
1716.lowfreq: -9.6410 -2.0460 0.0011 0.0016 0.0030 6.6878 20.4173 28.7432 34.3896
frequency: 19.6724 28.3377 33.9777 50.6373 63.6772 88.2385 115.3763 140.4702 166.9722 185.5879 196.9259 203.8867 215.6840 229.6961 237.7195 247.0140 275.0664 282.0197 321.0472 366.6065 369.2080 411.3707 420.8767 429.3617 448.6257 499.6052 647.4745 738.3613 815.4620 823.1378 894.5582 902.5648 915.1428 918.5414 924.4418 929.1412 953.9865 957.7638 965.2888 967.3455 1066.7425 1131.4298 1133.2911 1144.3961 1151.7222 1187.5501 1189.4055 1230.4274 1247.2952 1293.1147 1299.2184 1343.7040 1345.1594 1358.2654 1358.3669 1379.1492 1381.7156 1397.8884 1401.9610 1451.2569 1462.7294 1466.2353 1470.3986 1470.7825 1476.5893 1481.7827 1483.0365 1486.7521 1491.1825 2974.0980 2974.6612 2977.6871 2979.0753 2986.6711 2993.2590 3002.1909 3006.3151 3065.3898 3065.9948 3068.3644 3072.1827 3077.4823 3082.2678 3082.9230 3087.6609 3093.4434 3096.3935
redmass: 3.5241 3.7003 2.4658 4.0007 4.8966 4.5657 3.1201 4.7686 3.4004 2.6372 1.2734 1.1343 1.6191 4.4735 1.3833 1.7058 3.5046 5.5365 3.6474 3.3717 2.5058 2.1175 2.2790 3.4996 5.8980 5.3681 7.9626 9.3008 2.7179 2.6237 2.0133 1.6571 2.0338 1.6787 1.2799 1.6422 1.7261 2.0448 1.5937 1.6800 16.2123 2.2567 2.0362 1.6574 1.7203 1.7904 1.8021 1.2870 1.2223 1.3091 1.3106 1.3709 1.4026 1.3108 1.3912 1.2061 1.2087 1.2087 1.2070 1.0811 1.0621 1.0484 1.0447 1.0510 1.0724 1.0510 1.0522 1.0525 1.0553 1.0362 1.0358 1.0404 1.0375 1.0805 1.0580 1.0808 1.0584 1.1033 1.0994 1.1018 1.0994 1.1026 1.0990 1.0992 1.1065 1.0995 1.0994
irintensity: 0.6135 0.5985 0.4612 0.1298 0.7159 0.2431 2.3262 0.5302 10.5906 2.1116 0.5139 1.4725 1.5318 4.8035 5.2189 1.4384 2.9632 3.7618 3.4178 16.0560 6.9410 8.7145 10.5322 7.8029 107.2869 15.6074 67.3230 144.5769 11.5685 2.9853 77.3936 31.1481 181.9841 49.8657 72.0495 24.1343 100.9241 29.2563 1.1958 0.6323 112.0873 4.0954 1.4563 1.3108 1.4955 2.0001 11.2909 4.5127 1.3547 0.1180 0.6464 2.3500 2.6108 3.9486 0.3517 22.4932 19.7537 17.8412 23.4508 3.1626 5.3037 1.3334 2.8718 8.7459 11.2186 11.9369 10.0126 21.5126 25.9636 29.2920 26.0163 21.3333 25.7037 16.9497 17.0827 13.5785 28.2013 5.3225 16.2116 15.2292 30.3000 61.1328 56.1078 31.4637 27.5182 30.2049 27.1560
temp: 298.150 k
press: 1.00000 atm
elementType: 17 15 8 8 8 6 6 6 6 6 6 6 6 1 1 1 1 1 1 1 1 1 1 1 1 1 1 1 1 1 1
symmnumber: 1
zpe: 669122.1 jmol-1
zpe.correction: 0.254855 hartree
zpe.thermalcorrener: 0.272980 hartree
zpe.thermalcorrenthalpy: 0.273924 hartree
zpe.thermalcorrgfe: 0.206390 hartree
zpe.sumelectzpe: -1341.521085 hartree
zpe.sumelectthermal: -1341.502960 hartree
zpe.sumelectthermalent: -1341.502016 hartree
zpe.sumelectthermalfe: -1341.569550 hartree
dipole: -0.2531 -3.7335 1.7824
dipole: 4.1448
quadrupole: -79.7707 -100.1764 -101.8348
quadrupole: -3.0343 -2.7416 3.8208
quadrupole: 14.1566 -6.2491 -7.9075 -3.0343 -2.7416 3.8208
hfenergy: -1341.7759398 hartree
pointgroup: C01 [X(C8H18Cl1O3P1)]
dipole: 0.0859405 1.6141801 0.2150008 debye
polarizability: 159.3525918|3.7021863|115.5895563|4.2233085|-0.6482001|130.6801148 unknown
InChI: InChI=1S/C8H18O3P.Cl/c1-7(2)5-10-12(9)11-6-8(3)4;/h7-8H,5-6H2,1-4H3;
charge 0 multiplicity 1
31 atoms
Cl -0.580992 -1.26475 1.801161
P  -0.225853 -0.728211 -0.40867
O  1.445215 -0.418573 -0.456039
O  -0.886322 0.856984 -0.523977
O  -0.748645 -1.812851 -1.430484
C  3.588105 0.520733 0.20574
C  -3.356225 0.760862 0.036631
C  2.075694 0.595589 0.452428
C  -2.287533 1.019964 -1.038748
C  3.944416 0.875994 -1.254507
C  4.297532 1.46012 1.212394
C  -3.184753 1.701222 1.248614
C  -4.75075 0.919051 -0.618731
H  3.904299 -0.521707 0.407009
H  -3.253945 -0.288249 0.381597
H  1.819456 0.335289 1.496751
H  1.665313 1.591234 0.199514
H  -2.42388 0.356621 -1.913648
H  -2.295492 2.075638 -1.36246
H  5.031717 0.775223 -1.424093
H  3.660577 1.921145 -1.484914
H  3.419216 0.21152 -1.961246
H  5.39246 1.400751 1.079977
H  4.067992 1.191324 2.26042
H  3.997651 2.513481 1.052399
H  -3.928877 1.467368 2.031103
H  -3.327516 2.757256 0.947451
H  -2.178886 1.600387 1.691392
H  -5.54557 0.714407 0.120216
H  -4.887786 0.219863 -1.464642
H  -4.899413 1.949716 -0.994437
