program: Gaussian 09
title: 000190203
version: EM64L-G09RevD.01
frameworkgroup: C1[X(C7H9Cl2NO3S)]
method: RPBEPBE
basis: SDD
operation: Freq
keyword: #p
keyword: freq=noraman
keyword: PBEPBE/SDD
title: #p freq=noraman PBEPBE/SDD
converged: YES YES NO NO
title: Mulliken charges:
elementType: Cl Cl S O O O N C C C C C C C H H H H H H H H H
charge: 0.027134 0.022380 0.254937 -0.423823 -0.229042 -0.279539 -0.384377 -0.098394 -0.709208 0.176237 0.268940 -0.770612 -0.218255 -0.319625 0.305834 0.318182 0.287312 0.348163 0.256710 0.256398 0.217824 0.293794 0.399029
chargesum: 0.00000
title: Mulliken charges with hydrogens summed into heavy atoms:
elementType: Cl Cl S O O O N C C C C C C C
charge: 0.027134 0.022380 0.254937 -0.024793 -0.229042 -0.279539 -0.036213 0.207440 -0.103714 0.176237 0.268940 -0.039680 0.075539 -0.319625
polarizability: 1.72543788e+02 -1.76491504e+01 1.17254100e+02 -1.78507768e+01 -1.10097856e+01 9.77219653e+01
1716.lowfreq: -9.6871 -1.5805 -0.0010 0.0027 0.0027 4.8314 7.9120 25.4071 33.5630
frequency: 4.8776 25.3751 33.5411 51.9716 61.5238 73.9811 87.8367 108.8088 137.9027 160.5443 189.4408 208.1340 248.8084 279.4046 335.4917 350.5483 353.8287 406.9858 458.4113 508.6360 515.2785 551.3452 582.3210 599.5419 612.6290 622.2495 655.1793 722.7358 750.1357 773.2351 812.3540 838.8392 908.6810 942.1001 980.6023 993.9347 1044.3938 1083.2527 1139.0922 1190.9124 1222.2599 1237.9274 1245.2224 1291.5001 1321.6745 1330.4479 1390.8364 1429.1814 1450.2603 1462.6614 1481.0568 1604.6507 1607.2171 1665.6179 2972.8312 2999.9325 3049.5143 3100.0141 3104.8728 3129.8010 3165.8074 3524.0115 3569.9833
redmass: 10.3405 9.5329 8.5496 5.6627 11.1767 1.4681 2.5226 10.3000 5.6608 8.3756 5.8384 5.6307 8.5104 8.2540 3.6282 7.7087 4.0148 5.8000 3.3463 3.6552 4.2664 1.3513 6.9228 2.6819 3.6595 2.9918 1.8557 4.5854 8.3837 1.2609 3.2250 6.0253 2.7461 4.6247 2.8446 1.5539 1.6544 1.7930 2.7832 1.2843 1.2905 1.1827 1.5355 1.6989 1.3810 2.1602 1.2283 1.0817 1.0457 1.2239 1.7693 9.2561 6.4603 9.3170 1.0807 1.0360 1.0581 1.0981 1.1009 1.1076 1.0924 1.0644 1.0788
irintensity: 2.7238 1.8421 1.9023 2.5552 8.2922 4.9599 1.5503 0.6003 5.2843 1.7538 1.8740 1.2801 3.7823 2.6102 0.8096 4.2012 1.2011 7.0096 15.7689 33.2155 46.3506 55.0180 6.6260 40.9999 6.1248 74.4700 118.1170 15.4511 86.5093 53.7450 16.4013 88.4856 22.9601 17.7814 61.6110 3.0161 13.9222 166.5101 9.0257 16.2020 7.5218 17.0313 21.4428 62.0742 34.2388 23.0142 69.6439 33.9751 16.5996 145.7822 210.5735 7.0979 157.7494 189.5445 14.1436 7.5583 8.0873 7.7359 16.6728 1.5067 12.0500 38.1470 45.9916
temp: 298.150 k
press: 1.00000 atm
elementType: 17 17 16 8 8 8 7 6 6 6 6 6 6 6 1 1 1 1 1 1 1 1 1
symmnumber: 1
zpe: 411289.0 jmol-1
zpe.correction: 0.156652 hartree
zpe.thermalcorrener: 0.173281 hartree
zpe.thermalcorrenthalpy: 0.174225 hartree
zpe.thermalcorrgfe: 0.106941 hartree
zpe.sumelectzpe: -1869.659098 hartree
zpe.sumelectthermal: -1869.642469 hartree
zpe.sumelectthermalent: -1869.641525 hartree
zpe.sumelectthermalfe: -1869.708809 hartree
dipole: 1.2660 0.7209 3.0895
dipole: 3.4158
quadrupole: -116.6476 -104.0360 -98.0183
quadrupole: -3.1945 10.2798 1.1546
quadrupole: -10.4136 2.1980 8.2157 -3.1945 10.2798 1.1546
hfenergy: -1869.81575 hartree
pointgroup: C01 [X(C7H9Cl2N1O3S1)]
dipole: -0.6881143 -0.5398543 1.0203018 debye
dipolederiv: -0.4584767 0.3410268 -0.0355582 0.4440095 -0.4762183 -0.1110909 -0.0051917 -0.1404003 -0.0875196 -0.1912283 -0.0180206 -0.1425126 -0.0968031 -0.3380935 -0.3273667 -0.2355271 -0.2910414 -0.3323563 -0.3623983 0.0775884 -0.0503878 0.3636082 -0.0684722 0.1976306 -0.0270573 0.0308708 -0.0346019 -0.365124 -0.0550356 0.0492657 -0.1271714 -0.4077975 0.2394461 0.2326858 0.2245708 -1.0711451 -0.5406004 0.1906271 0.1953564 0.1698208 -0.7250159 -0.2631075 0.1560999 -0.0341179 -0.6800298 -0.7087241 0.225261 -0.0527671 0.2493335 -0.555755 0.0161724 -0.2512864 0.1798876 -0.8569327 -1.040791 0.3880941 0.0226212 0.4360882 -0.807403 0.0444412 0.0858053 0.0596246 -0.418353 0.2509632 0.0485326 -0.1440806 -0.1227885 0.0684383 0.0958687 -0.4576464 0.329034 0.1619105 0.4012227 0.2175543 0.1085879 0.2443587 -0.0380142 0.0208307 0.2550372 -0.0769256 0.1289317 0.4425712 -0.4068046 -0.1997482 -0.2224885 1.0000264 -0.0139001 -0.3509683 -0.2355068 1.3475599 1.1569967 -0.7322207 0.0678045 -0.8502264 0.8413461 -0.0086477 0.1987195 -0.1195715 1.0124832 -0.1171511 0.1163237 0.1566038 0.1371204 -0.1082116 -0.1765742 0.1671153 -0.1608195 -0.1884614 0.1743847 -0.2400238 0.0790641 -0.5520316 -0.0700168 -0.2478857 -0.0549619 -0.0961218 -0.240775 0.5019144 -0.3040025 0.2160463 -0.2650514 0.8497735 0.6132305 0.2982266 0.5741565 0.4484661 0.0225742 -0.0698027 -0.0571676 -0.0632564 0.073374 -0.0093289 0.0822614 -0.0797239 0.0503426 0.0584822 0.0035336 -0.0703814 -0.0429112 0.0176103 0.0274698 -0.0597048 0.0315261 0.1001255 -0.050211 0.0117868 0.0433566 -0.0392116 0.0687753 -0.1145762 0.0274895 -0.0670295 -0.0031716 0.2788102 0.0398681 -0.0158067 0.0761635 0.2946648 -0.0113655 0.0034475 -0.0315768 0.1589748 0.1299469 -0.0537087 -0.0044198 -0.0188769 -0.0661108 -0.0036649 0.0250811 0.0258 0.0796444 -0.0803838 -0.015292 0.0127493 -0.0455988 0.127716 0.0061148 -0.0129204 -0.0243419 0.0854976 0.0637335 0.0535386 -0.0942374 0.0545185 0.0602194 0.0849539 -0.0344925 0.0331241 -0.088262 0.1152481 0.0335606 -0.0902315 0.1301267 0.0588403 -0.0317586 -0.0694859 -0.0652598 0.0949346 0.3182405 0.1476155 0.005843 0.1412677 0.2003245 -0.0268919 0.0272736 -0.0661578 0.3327374 unknown
polarizability: 158.27793|-34.5639462|120.9460907|16.9498262|10.0101998|108.2958331 unknown
InChI: InChI=1S/C7H9Cl2NO3S/c1-4(11)10-5(7(12)13)2-14-3-6(8)9/h3,5,10,12H,2H2,1H3
charge 0 multiplicity 1
23 atoms
Cl 4.555673 -1.615932 0.065107
Cl 3.880292 0.961282 1.536968
S  1.137363 1.285528 -0.365643
O  -0.818286 -1.840149 1.117846
O  -0.065129 -2.344459 -1.021475
O  -3.291617 1.658948 -0.976043
N  -1.930609 0.452105 0.45348
C  -1.302187 -0.252482 -0.663215
C  -0.27287 0.621562 -1.435085
C  -0.669904 -1.576228 -0.245026
C  -2.924089 1.388067 0.210529
C  -3.527517 2.055874 1.437809
C  2.293756 -0.11302 -0.483016
C  3.407612 -0.234391 0.272147
H  -2.095629 -0.484165 -1.406015
H  -0.796244 1.516125 -1.806931
H  0.152812 0.063049 -2.283979
H  -1.638447 0.213473 1.401984
H  -3.351932 3.144025 1.381099
H  -4.619914 1.901054 1.431486
H  -3.116276 1.67781 2.389179
H  2.063377 -0.87276 -1.236553
H  -0.369438 -2.697915 1.348648
